{"text_format":"1","workbook":"xlsx","n_sheets":30,"sheets":["Version History","Instructions","Project Info","Table Of Contents","ERMs","Prerequisites Checklist","Prescriptive Path Checklist","Prescriptive Tables 1, 2 & 3","Overview","1.1 - APPLIANCES","2.1-2.2 - DOMESTIC HOT WATER","3.1 - ENV_BELOW GRADE WALLS","3.1 - ENV_ABOVE GRADE WALLS","3.2 - ENV_ROOF","3.3 - ENV_FLOORS","3.4 - ENV_WINDOWS","3.5 - ENV_EXTERIOR DOORS","4.1 - GARAGES_CMPTZ & HEATING ","5.1, 5.3 - HEATING","5.2, 5.4 - COOLING","6.1, 6.2, 6.3 - LIGHTING","7.1 - MOTORS","8.1 - INF_EXT AIR BARRIER","8.1-INF_COMPTZN VIS INSPECTION","8.1 - INF_BLOWER DOOR TEST","8.2 - VENT_SCHEDULE&TAB REPORT","8.2 - VENT_DUCT TIGHTNESS","9.1 - METERS","Admin","Sheet2"],"not_rendered":{"charts":1,"images":26,"macros":1,"external_links":3,"defined_names":175,"comments":7,"pivot_tables":0},"unopened":[],"bounds":{"document_bytes":16777216,"sheet_cells":100000,"rows_first":2000,"rows_last":500,"rows_between":2000,"halvings":0,"cell_chars":16384,"cell_head_chars":4096},"cells_cut":0,"cells_raw":0,"read":"whole","date_system":"1900"}

{"sheet":"Version History","index":0,"n_rows":21,"n_cols":3,"rows_kept":21,"cut":false,"hidden":false,"merged":[[5,1,5,2],[0,1,0,2]]}
[null,"Version 1.7 Summary of Changes"]
[null,"Prerequisites and Prescriptive Path Checklist","Per 2015 policy record, updated language related to DHW pipe insulation and mixing valves."]
[null,"Prescriptive Path Checklist and Prescriptive Tables 1,2 &3","Corrections to slab insulation, CFM for ventilation duct leakage and error checking formula"]
[null,"6.1,6.2,6.3 - LIGHTING","This worksheet can be completed prior to As-Built;not required for Proposed Design Submittal. Performance Path Calculator lighting worksheets are required at Proposed Design, even in Prescriptive Path."]
[]
[null,"Version 1.6 Summary of Changes"]
[null,"Project Info","Added field to identify the equivalent ASHRAE 90.1 Standard that applies to the project. This may change the Performance Target for projects with Project Applications submitted on or after January 1, 2015. \nRequesting county in order to verify climate zone."]
[null,"Prerequisites Checklist","Added hyperlinks to columns C through F to facilitate navigation throughout the worksheets."]
[null,"Prescriptive Path Checklist and Prescriptive Tables 1,2 &3","These tabs have been hidden and will only re-appear if Prescriptive Path is selected in the Project Info tab (cell C4)."]
[null,"ERMs","Modified hidden comments to prompt user input and pre-populated more fields in the Baseline column (white cells do not need to be edited)."]
[null,"1.1 - APPLIANCES thru 9.1 METERS","Added buttons at top of each worksheet to navigate back to Table of Contents, ERMs, Prerequisites and Overview worksheets. Note: Previous TOC \"hyperlink\" has been replaced with a \"button\". Specific cells within each worksheet are also hyperlinked to the related Prerequisite in the Prerequisites Checklist."]
[null,"1.1 - APPLIANCES thru 9.1 METERS","Added \"Check empty cells\" button at top right corner of each protocol tab to help identify mandatory cells not filled out. By clicking the button, if there are any empty cells that should had been filled out, these cell's background will show highlighted in pink and a warning message will appear. After the empty cells have been filled out, by clicking the button again, the cells will come back to their original background color.  "]
[null,"1.1 - APPLIANCES thru 9.1 METERS","Where needed, clarified and renamed column headers of tables/schedules."]
[null,"3.1, 3.2, 3.3, 4.1, 8.1 ","Revised language to clarify that following ENERGY STAR Certified Homes Thermal Enclosure System Rater Checklist Sections 3 and 5 is \"recommended\" for wood-framed construction, but not required."]
[null,"4.1 - GARAGES_CMPTZ & HEATING ","Revised language to clarify the prerequisites related to pipe freeze protection and snow- and ice-melt systems in garages."]
[null,"8.2 - VENT_SCHEDULE&TAB REPORT","Revised row 141 to reference correct ASHRAE requirement 62.2 - 2007, consistent with Program requirements."]
[null,"8.2 - VENT_SCHEDULE&TAB REPORT","Revised row 77 to have \"Apt # or Space\" in each shaft columns; since these tables are to be used for apartment and non-apartment ventilation test results."]
[null,"1.1 - APPLIANCES thru 9.1 METERS","Removed Statement of Substantial Completion row for items where a Statement is not applicable."]
[null,"1.1 - APPLIANCES thru 9.1 METERS","Added more details to the Inspection Checklist Comments instructions. "]
[null,"5.2, 5.4 - COOLING","Clarified that cooling pipe insulation prerequisite also applies to refrigerant pipe/lines."]
[null,"6.1,6.2,6.3 - LIGHTING","Added measurement option for illumination as alternative to design calculations"]

{"sheet":"Instructions","index":1,"n_rows":69,"n_cols":13,"rows_kept":69,"cut":false,"hidden":false,"merged":[[68,0,75,13],[40,1,40,13],[41,1,41,13],[42,1,42,13],[13,2,14,13],[10,2,11,13],[38,1,38,13],[39,1,39,13],[66,4,66,6],[43,1,43,13],[44,1,44,13],[45,1,45,13],[58,1,58,13],[59,1,59,13],[63,1,63,13],[50,1,50,13],[55,1,55,13],[56,1,56,13],[57,1,57,13]]}
[]
[null,"T&V Worksheets Version 1.7- Instructions",null,null,null,null,null,null,null,null,null,null,"OMB Control Number: 2060-0586"]
[null,null,null,null,null,null,null,null,null,null,null,null,"Expiration Date: 01-31-2024"]
[null,"Click the link below or paste the web address into your browser to watch the T&V Worksheets Training Video:",null,null,null,null,null,null,null,null,null,null,"EPA Form Number: 5900-269"]
[null,"http://www.youtube.com/watch?v=gco7heVBBZY"]
[]
[1,"General Formatting"]
[]
[1.1000000000000001,"Cells"]
[]
[null,null,"= Proposed ERM and Values used for Energy Model. Enter data in these orange cells in the ‘ERMs’ worksheet ONLY. All other orange cells in this workbook link back to the ‘ERMs’ worksheet for relevant data."]
[]
[]
[null,null,"= Comments made during Plan Review. Enter data in these blue cells in the Inspections Worksheets ONLY. All other blue cells (including those in the ‘ERMs’ and ‘Overview’ worksheets) link back to the Inspection Worksheets for relevant data."]
[]
[]
[null,null,"= Fill data in this cell after site Inspection "]
[]
[null,null,"= Baseline Reference - ASHRAE 90.1"]
[]
[null,null,"= Information in this cell is fed to other spreadsheets "]
[]
[]
[1.2,"Worksheets"]
[]
[null,null,"= Introductory Worksheets"]
[]
[null,null,"= Performance Values & Deliverables"]
[]
[null,null,"= Inspection Worksheet, typically completed during Pre-Drywall or Drywall Inspection"]
[]
[null,null,"= Inspection Worksheet, typically completed during Finishes"]
[]
[null,null,"= Inspection Worksheet, typically completed during Construction Close-out"]
[]
[]
[2,"Summary"]
[]
[{"$f":"A37+0.1","v":2.1},"Energy reduction measures are first described in the 'ERMs' Worksheet in the column labeled \"Proposed Method of Compliance\".  Energy reduction measures are determined by the Design Team when following the MFHR Performance Path or by the requirements listed in the ENERGY STAR MFHR Prescriptive Path for your climate zone."]
[{"$f":"A39+0.1","v":2.2000000000000002},"When following the Performance Path, data entered in the “Proposed Method of Compliance” column of the ‘ERMs’ worksheet provide guidance for energy modeling inputs & assumptions entered in the adjacent “Values used in Energy Model” Column."]
[2.3000000000000003,"Both the \"Proposed Method of Compliance\" and the \"Values Used in Energy Model\" columns are linked to relevant cells/worksheets throughout the individual T&V Worksheets. For both the Performance Path and the Prescriptive Path, this provides the person responsible for reviewing construction documents and on site inspections necessary information to confirm whether program goals and design intent have been met."]
[2.4000000000000004,"After the construction documents have been reviewed and feedback provided in the T&V Worksheets, it is linked back to the 'Overview' Worksheet which serves as a summary of the plan review. The next step is either to make revisions to the modeling inputs and/or provide feedback to the project team on how to bring the design in line with the assumptions made in the energy model or requirements as specified in the Prescriptive Path.  The 'Overview' Worksheet can also be used as the deliverable to provide feedback to the project team.  Rows and columns can be hidden as review items become closed, or if the deliverable is being sent to the project Architect or Engineer and only certain items are applicable.  This helps minimize the size and makes the document a more manageable discussion piece."]
[2.5000000000000004,"All prerequisites listed in the T&V Worksheets are linked to the 'Prerequisites Checklist'; all requirements of the Prescriptive Path are linked to the 'Prescriptive Path Checklist'. Prior to submitting the T&V Worksheets to EPA, review the applicable checklist to confirm that all prerequisites or prescriptive requirements have been verified. "]
[2.6000000000000005,"After the final plan review confirms all recommendations have been integrated in to the construction documents, the T&V Worksheets are intended to be printed and brought to the field.  They list measures and building components to be inspected as well as mandatory requirements and/or energy modeling assumptions to be confirmed and any additional relevant information identified during the plan review."]
[2.7000000000000006,"Post-inspection feedback entered into each worksheet is linked back to the 'ERMs' Worksheet as a summary for updating the Final Building energy model per as-built conditions or to identify measures needing corrections.  They are also linked to the 'Overview' Worksheet serving as a project overview from design to completion."]
[2.8000000000000007,"The T&V Worksheets in the As-Built submittal will represent the conditions of the Final Building and do not need to include information from each site visit as long as the Final Building meets the requirements of the Prescriptive Path or has an energy model that complies with the Performance Target, and the prerequisites have been met or exceeded.  In other words, it's not necessary to update the digital version of the worksheets after each site visit, as long as the final conditions are documented in the submitted version.  At a minimum, T&V Worksheets filled in by hand at each inspection shall be kept on file in the case further information is requested by EPA."]
[]
[]
[3,"Navigating"]
[]
[3.1,"The Worksheet labeled 'Table of Contents' can be used to quickly jump to the desired T&V Worksheet.  Additionally each green protocol worksheet has buttons at the top that bring you back to the various worksheets."]
[]
[]
[4,"T&V Worksheets - Overview"]
[]
[{"$f":"A54+0.1","v":4.0999999999999996},"Each T&V Worksheet is formatted similarly to easily locate the sections used at different stages throughout the project.  The header contains the name of the project, building component being reviewed/inspected and a box to enter the date inspections occur and who conducted them."]
[{"$f":"A56+0.1","v":4.1999999999999993},"Each T&V Worksheet also contains sections titled \"Schedule\", \"Equipment Needed\" and \"Sampling Requirements\".  The \"Schedule\" section gives recommendations about the appropriate time to begin inspecting that particular component and sometimes suggests the minimum number of inspections.  \"Sampling Requirements\" outlines appropriate sampling rates, minimum sample set requirements and mandatory photographs to be included as documentation."]
[{"$f":"A57+0.1","v":4.2999999999999989},"Most T&V Worksheets contain sections titled \"Notes for Drawings and Specifications\".  This is meant to be used in the plan review stage for easy access to language to be copied and pasted into the cells labeled \"Plan Review Comment\".  This section and any others not needed can be hidden when printing for the field to condense the size as much as possible.  The more complex building components, such as HVAC, do not have the \"Notes for Drawings and Specifications\" section because there are too many notes to put in one cell; they are broken up line by line in elements below."]
[{"$f":"A58+0.1","v":4.3999999999999986},"Some T&V Worksheets have schedules for building HVAC equipment or envelope assemblies for easier tracking of characteristics specific to that type of component.  These rows have been left unlocked so they can be copied for various assemblies, or rows can be inserted for additional equipment."]
[{"$f":"A59+0.1","v":4.4999999999999982},"Each T&V Worksheet lists the individual elements from the ENERGY STAR MFHR Testing and Verification Protocols (T&V Protocols) that needs to be checked either in the design phase and/or during construction. For both the \"Plan Review\" and \"Inspection\" columns, there is a comment box for feedback as well as a verification input where you can choose one of the following after reviewing that particular element. This information links back to the 'ERMs', 'Overview', and 'Prerequisites Checklist' Worksheets for easy reference when updating the model, communicating with the project team or EPA."]
[null,"a)  Yes - Verified"]
[null,"b)  No - Not Verified"]
[null,"c)  N/A - Not Applicable"]
[4.5999999999999996,"After the plan review or inspection has been completed, the T&V Worksheets or sections of the 'Overview' Worksheet can be printed and used as deliverables to provide feedback to the project team."]
[]
[5,"Help"]
[5.0999999999999996,"Send questions and comments to",null,null,"MFHR@energystar.gov"]
[]
["This collection of information is approved by OMB under the Paperwork Reduction Act, 44 U.S.C. 3501 et seq. (OMB Control No. 2060-0586). Responses to this collection of information are voluntary. An agency may not conduct or sponsor, and a person is not required to respond to, a collection of information unless it displays a currently valid OMB control number. The public reporting and recordkeeping burden for this collection of information is estimated to be 8 hours per response. Send comments on the Agency’s need for this information, the accuracy of the provided burden estimates and any suggested methods for minimizing respondent burden including through the use of automated collection techniques to the Director, Regulatory Support Division, U.S. Environmental Protection Agency (2821T), 1200 Pennsylvania Ave., NW, Washington, D.C. 20460.  Include the OMB control number in any correspondence.  Do not send the completed form to this address."]

{"sheet":"Project Info","index":2,"n_rows":62,"n_cols":16,"rows_kept":62,"cut":false,"hidden":false,"merged":[[14,1,16,1],[17,1,19,1],[20,1,22,1],[25,1,26,1],[27,1,28,1],[23,1,24,1]]}
[]
[]
[null,"Project Name: "]
[null,"Compliance Path:"]
[null,"State Energy Code (or Equivalency)",null,"For Project Applications submitted on or after January 1, 2015, state energy code is used to determine the appropriate ASHRAE Baseline & Performance Target."]
[null,"Street Address: ",null,"For Project Applications submitted prior to January 1, 2015, you may select ASHRAE 90.1-2007, regardless of current state energy code."]
[null,"City, State, Zip & County:"]
[null,"Climate Zone"]
[]
[null,"Is this project participating in any state or local ENERGY STAR program?"]
[]
[null,"Is this project participating in NYSERDA's Multifamily Performance Program?"]
[]
[null,"Team","First Name","Last Name","Email","Office Phone","Direct Line"]
[null,"Developer"]
[]
[]
[null,"Marketing Consultant"]
[]
[]
[null,"Architect"]
[]
[]
[null,"MEP Engineer"]
[]
[null,"General Contractor"]
[]
[null,"MEP Contractor"]
[]
[]
[]
[]
[null,"For Prescriptive Path Projects Only"]
[null,null,null,null,null,null,null,null,null,null,null,null,null,null,null,"Compliance Path"]
[null,null,null,null,null,null,null,null,null,null,null,null,null,null,null,"Prescriptive"]
[null,null,null,null,null,null,null,null,null,null,null,null,null,null,null,"Performance"]
[null,"Number of Stories"]
[null,null,null,null,null,null,null,null,null,null,null,null,null,null,null,"Climate Zone"]
[null,null,"Number of Units (per building)","Typical SF of apartment",null,null,null,null,null,null,null,null,null,null,null,1]
[null,"Studio",null,null,null,null,null,null,null,null,null,null,null,null,null,2]
[null,"1 - Bedroom",null,null,null,null,null,null,null,null,null,null,null,null,null,3]
[null,"2 - Bedroom",null,null," ",null,null,null,null,null,null,null,null,null,null,4]
[null,"3 - Bedroom",null,null,null,null,null,null,null,null,null,null,null,null,null,5]
[null,"4 - Bedroom",null,null,null,null,null,null,null,null,null,null,null,null,null,6]
[null,null,null,null,null,null,null,null,null,null,null,null,null,null,null,7]
[null,null,"Building Areas (per building)",null,null,null,null,null,null,null,null,null,null,null,null,8]
[null,"Building Area","Total Square Ft"]
[null,"Apartment"]
[null,"Storage, active"]
[null,"Storage, inactive"]
[null,"Lobby"]
[null,"Corridor/Transition"]
[null,"Stairs - Active"]
[null,"Restroom"]
[null,"Office"]
[null,"Conference/meeting/multipurpose"]
[null,"Electrical/Mechanical"]
[null,"Workshop"]
[null,"Parking garage"]
[null,"Nonresidential Spaces (ie. commercial)"]
[]
[null,"Type of Garage"]

{"sheet":"Table Of Contents","index":3,"n_rows":30,"n_cols":4,"rows_kept":30,"cut":false,"hidden":false,"merged":[[20,2,22,2],[24,1,26,1],[27,1,28,1],[6,1,8,1],[11,1,12,1],[13,1,14,1]]}
[]
[]
[null,"T&V Protocol Number and Description","T&V Worksheet","Potential Inspection Schedule Categories"]
[null,"Protocol 1.1 - ENERGY STAR Certified Appliances","1.1 - APPLIANCES","Post-Completion"]
[null,"Protocol 2.1 - Central DHW Systems (Serving 5+units/spaces)","2.1-2.2, 5.1, 5.3 - HEATING&DHW","Finishes"]
[null,"Protocol 2.2 - Distributed DHW (Individual Apartment or Common Space) Systems","2.1-2.2, 5.1, 5.3 - HEATING&DHW","Finishes"]
[null,"Protocol 3.1 - Wall Construction/Insulation, R-value","3.1 - ENV_BELOW GRADE WALL","Pre-Drywall"]
[null,null,"3.1 - ENV_ABOVE GRADE WALL","Pre-Drywall"]
[null,null,"8.1 - INF_EXT AIR BARRIER","Pre-Drywall"]
[null,"Protocol 3.2 - Roof Construction/Insulation, R-value","3.2 - ENV_ROOF","Pre-Drywall"]
[null,"Protocol 3.3 - Floor Construction/Insulation, R-value","3.3 - ENV_FLOORS","Pre-Drywall"]
[null,"Protocol 3.4 - Window Selection, U-value, and SHGC","3.4 - ENV_WINDOWS","Pre-Drywall"]
[null,null,"8.1 - INF_EXT AIR BARRIER","Pre-Drywall"]
[null,"Protocol 3.5 - Exterior Door Selection, Entranceway Design, Use of Vestibules, Weather-stripping, and Air Leakage ","3.5 - ENV_EXTERIOR DOORS","Post-Completion"]
[null,null,"8.1 - INF_EXT AIR BARRIER","Pre-Drywall"]
[null,"Protocol 4.1 – Heating and Compartmentalization","4.1 - GARAGES_CMPTZ & HEATING","Pre-Drywall"]
[null,"Protocol 5.1 - Central Heating Systems (Serving 5+ units/spaces)","2.1-2.2, 5.1, 5.3 - HEATING&DHW","Finishes"]
[null,"Protocol 5.2 - Central Cooling Systems (Serving 5+ units/spaces)","5.2, 5.4 - COOLING","Finishes"]
[null,"Protocol 5.3 - Distributed (Individual Apartment or Common Space) Heating Systems","2.1-2.2, 5.1, 5.3 - HEATING&DHW","Finishes"]
[null,"Protocol 5.4 - Distributed (Individual Apartment or Common Space) Cooling Systems","5.2, 5.4 - COOLING","Finishes"]
[null,"Protocol 6.1 - Common Areas, In-Unit, Garage and Exterior Lighting","6.1, 6.2, 6.3 - LIGHTING","Finishes"]
[null,"Protocol 6.2 – Emergency Lighting (Exit Signs)",null,"Finishes"]
[null,"Protocol 6.3 – Controls",null,"Finishes"]
[null,"Protocol 7.1 - Motors","7.1 - MOTORS","Finishes"]
[null,"Protocol 8.1 - Building Envelope Air Sealing and Compartmentalization Testing","8.1 - INF_EXT AIR BARRIER","Pre-Drywall"]
[null,null,"8.1-INF_COMPTZN VIS INSPECTION","Pre-Drywall"]
[null,null,"8.1 - INF_BLOWER DOOR TEST","Post-Completion"]
[null,"Protocol 8.2 - Common Area and In-Unit Ventilation (CFM), Fan Efficiency, Central Exhaust Duct Leakage","8.2 - VENT_SCHEDULE&TAB REPORT","Finishes"]
[null,null,"8.2 - VENT_DUCT TIGHTNESS","Pre-Drywall"]
[null,"Protocol 9.1 - Metering Configuration","9.1 - METERS","Post-Completion"]

{"sheet":"ERMs","index":4,"n_rows":67,"n_cols":14,"rows_kept":67,"cut":false,"hidden":false,"merged":[[2,0,2,1],[4,0,4,1],[67,0,67,3],[8,4,8,5],[8,0,9,0],[8,1,9,1],[3,0,3,1],[5,0,6,1]]}
[]
["Instructions"]
["1)  If following the Performance Path, fill in columns B, C and D which link to the respective T&V Worksheets.  If following the Prescriptive Path, column C shall be filled in according to the requirements of the Prescriptive Path; column B and D can be ignored."]
["2) Review plan review comments to confirm project specifications are consistent with the Proposed Design model or meets or exceeds the requirements listed in the Prescriptive Path. If applicable, the energy model shall be updated where the design does not match the Proposed Design model to ensure the performance target will be met."]
["3) Review inspection comments to confirm the Final Building is consistent with the Proposed Design model or meets or exceeds the requirements listed in the Prescriptive Path. If applicable, the energy model shall be updated where the Final Building does not match the Proposed Design model to ensure the performance target has been met."]
["4)  The Proposed Method of Compliance (Column C) should not be modified once construction begins.  Changes to design should be documented in the Inspection Comments of individual protocol worksheets."]
[]
[{"$f":"'Project Info'!C3&\" Energy Reduction Measures\"","v":" Energy Reduction Measures"}]
["Building Component ","Baseline for Energy Model\nASHRAE 90.1-2007 or 90.1-2010\n(Performance Path Only)","Date Revised:\nBy:","Date Revised:\nBy:","# REVIEW:  75% and 100% Design Completion Review\nPrepared by:\nDate:",null,{"$f":"Overview!J12","v":"AS BUILT REVIEW: \nPrepared by:\nDate: "}]
[null,null,"Proposed Method of Compliance \n(by PM/client)","Values Used in Energy Model (Performance Path Only) \nModeling Submittal Notes","Plan Review Comments ","Location (dwg / spec)","Inspection Comments "]
["APPLIANCES"]
[{"$f":"'1.1 - APPLIANCES'!D26","v":"Refrigerators"},"Fed Min Std Refrigerator\n529 kWh",null,null,{"$f":"'1.1 - APPLIANCES'!L26","v":0},{"$f":"'1.1 - APPLIANCES'!M26","v":0},{"$f":"'1.1 - APPLIANCES'!P26","v":0}]
[{"$f":"'1.1 - APPLIANCES'!D27","v":"Dishwashers"},"Fed Min Std Dishwasher\nEF=0.46, 206 kWh/yr, 1,290 gal/yr",null,null,{"$f":"'1.1 - APPLIANCES'!L27","v":0},{"$f":"'1.1 - APPLIANCES'!M27","v":0},{"$f":"'1.1 - APPLIANCES'!P27","v":0}]
[{"$f":"'1.1 - APPLIANCES'!D28","v":"Clothes Washers"},"Enter In-Unit or Common",null,null,{"$f":"'1.1 - APPLIANCES'!L28","v":0},{"$f":"'1.1 - APPLIANCES'!M28","v":0},{"$f":"'1.1 - APPLIANCES'!P28","v":0}]
[{"$f":"'1.1 - APPLIANCES'!D29","v":"Ceiling fans"},"Not modeled explicitly",null,null,{"$f":"'1.1 - APPLIANCES'!L29","v":0},{"$f":"'1.1 - APPLIANCES'!M29","v":0},{"$f":"'1.1 - APPLIANCES'!P29","v":0}]
[{"$f":"'1.1 - APPLIANCES'!D30","v":"Vending Machines"},"Not modeled explicitly",null,null,{"$f":"'1.1 - APPLIANCES'!L30","v":0},{"$f":"'1.1 - APPLIANCES'!M30","v":0},{"$f":"'1.1 - APPLIANCES'!P30","v":0}]
["Stove","Enter Fuel",{"$f":"B17","v":"Enter Fuel"},null,{"$f":"'1.1 - APPLIANCES'!G32","v":0},{"$f":"'1.1 - APPLIANCES'!M32","v":0},{"$f":"'1.1 - APPLIANCES'!P32","v":0}]
["Dryer","Enter Fuel",{"$f":"B18","v":"Enter Fuel"},null,{"$f":"'1.1 - APPLIANCES'!G33","v":0},{"$f":"'1.1 - APPLIANCES'!M33","v":0},{"$f":"'1.1 - APPLIANCES'!P33","v":0}]
["DOMESTIC HOT WATER","DHW measures listed below must comply with ASHRAE Standard 90.1-2007 Section 7.4 in addition to the listed requirements below. "]
["Domestic Hot Water-Type & Efficiency","Select one based on Proposed Design:\nCentral Gas Boiler: 80% Thermal Efficiency\nIn-Unit Gas Storage: 0.62-0.0019V EF; \nIn-Unit Electric Storage: 0.93-0.00132V EF",null,null,{"$f":"'2.1-2.2 - DOMESTIC HOT WATER'!H48","v":0},{"$f":"'2.1-2.2 - DOMESTIC HOT WATER'!M48","v":0},{"$f":"'2.1-2.2 - DOMESTIC HOT WATER'!P48","v":0}]
["Domestic Hot Water - Storage Insulation","Unfired Storage tank: R-12.5\nIn-Unit Storage: NA (included in EF)",null,null,{"$f":"'2.1-2.2 - DOMESTIC HOT WATER'!H49","v":0},{"$f":"'2.1-2.2 - DOMESTIC HOT WATER'!M49","v":0},{"$f":"'2.1-2.2 - DOMESTIC HOT WATER'!P49","v":0}]
["Domestic Hot Water - Low Flow Fixtures","Showerheads: 2.5 gpm\nKitchen Faucets: 2.5 gpm\nLavatory Faucets: 2.5 gpm\nToilets: 1.6 gallons per flush",null,null,{"$f":"'2.1-2.2 - DOMESTIC HOT WATER'!H50","v":0},{"$f":"'2.1-2.2 - DOMESTIC HOT WATER'!M50","v":0},{"$f":"'2.1-2.2 - DOMESTIC HOT WATER'!P50","v":0}]
["ENVELOPE ","The envelope measures listed below must comply with ASHRAE Standard 90.1-2007 Section 5.4 in addition to the listed requirements."]
["Below Grade Wall Insulation",{"$f":"IF('Project Info'!$C$8=\"\", \"Select climate zone on 'Project Info' tab\", IF('Project Info'!$C$5=\"ASHRAE 90.1-2007\", 'Prescriptive Tables 1, 2 & 3'!C82,'Prescriptive Tables 1, 2 & 3'!D82))","v":"Select climate zone on 'Project Info' tab"},null,null,{"$f":"'3.1 - ENV_BELOW GRADE WALLS'!F45","v":0},{"$f":"'3.1 - ENV_BELOW GRADE WALLS'!G45","v":0},{"$f":"'3.1 - ENV_BELOW GRADE WALLS'!J45","v":0}]
["Above Grade Wall Insulation",{"$f":"IF('Project Info'!$C$8=\"\", \"Select climate zone on 'Project Info' tab\", IF('Project Info'!$C$5=\"ASHRAE 90.1-2007\", 'Prescriptive Tables 1, 2 & 3'!C80,'Prescriptive Tables 1, 2 & 3'!D80))","v":"Select climate zone on 'Project Info' tab"},null,null,{"$f":"'3.1 - ENV_ABOVE GRADE WALLS'!F61","v":0},{"$f":"'3.1 - ENV_ABOVE GRADE WALLS'!G61","v":0},{"$f":"'3.1 - ENV_ABOVE GRADE WALLS'!J61","v":0}]
["Floor Perimeter/Plank Edge Insulation",{"$f":"B25","v":"Select climate zone on 'Project Info' tab"},null,null,{"$f":"'3.1 - ENV_ABOVE GRADE WALLS'!F63","v":0},{"$f":"'3.1 - ENV_ABOVE GRADE WALLS'!G63","v":0},{"$f":"'3.1 - ENV_ABOVE GRADE WALLS'!J63","v":0}]
["Roof Insulation",{"$f":"IF('Project Info'!$C$8=\"\", \"Select climate zone on 'Project Info' tab\", IF('Project Info'!$C$5=\"ASHRAE 90.1-2007\", 'Prescriptive Tables 1, 2 & 3'!C78,'Prescriptive Tables 1, 2 & 3'!D78))","v":"Select climate zone on 'Project Info' tab"},null,null,{"$f":"'3.2 - ENV_ROOF'!F46","v":0},{"$f":"'3.2 - ENV_ROOF'!G46","v":0},{"$f":"'3.2 - ENV_ROOF'!J46","v":0}]
["Floor Insulation Above Unconditioned Space",{"$f":"IF('Project Info'!$C$8=\"\", \"Select climate zone on 'Project Info' tab\", IF('Project Info'!$C$5=\"ASHRAE 90.1-2007\", 'Prescriptive Tables 1, 2 & 3'!C84,'Prescriptive Tables 1, 2 & 3'!D84))","v":"Select climate zone on 'Project Info' tab"},null,null,{"$f":"'3.3 - ENV_FLOORS'!F34","v":0},{"$f":"'3.3 - ENV_FLOORS'!G34","v":0},{"$f":"'3.3 - ENV_FLOORS'!J34","v":0}]
["Below Grade Slab Floor Insulation","Uninsulated",null,null,{"$f":"'3.3 - ENV_FLOORS'!F44","v":0},{"$f":"'3.3 - ENV_FLOORS'!G44","v":0},{"$f":"'3.3 - ENV_FLOORS'!J44","v":0}]
["Slab-on-Grade Insulation (unheated)",{"$f":"IF('Project Info'!$C$8=\"\", \"Select climate zone on 'Project Info' tab\", IF('Project Info'!$C$5=\"ASHRAE 90.1-2007\", 'Prescriptive Tables 1, 2 & 3'!C86,'Prescriptive Tables 1, 2 & 3'!D86))","v":"Select climate zone on 'Project Info' tab"},null,null,{"$f":"'3.3 - ENV_FLOORS'!F54","v":0},{"$f":"'3.3 - ENV_FLOORS'!G54","v":0},{"$f":"'3.3 - ENV_FLOORS'!J45","v":0}]
["Slab-on-Grade Insulation (embedded heated only)",{"$f":"IF('Project Info'!$C$8=\"\", \"Select climate zone on 'Project Info' tab\", IF('Project Info'!$C$5=\"ASHRAE 90.1-2007\", 'Prescriptive Tables 1, 2 & 3'!C87,'Prescriptive Tables 1, 2 & 3'!D87))","v":"Select climate zone on 'Project Info' tab"},null,null,{"$f":"'3.3 - ENV_FLOORS'!F64","v":0},{"$f":"'3.3 - ENV_FLOORS'!G64","v":0},{"$f":"'3.3 - ENV_FLOORS'!J64","v":0}]
["Windows & Window to Wall Ratio","Enter value from ASHRAE Table 5.5-1 through 5.5-8 for Vertical Glazing and Proposed frame material\nWindow to wall Ratio not to exceed 40%",null,null,{"$f":"'3.4 - ENV_WINDOWS'!G39","v":0},{"$f":"'3.4 - ENV_WINDOWS'!M39","v":0},{"$f":"'3.4 - ENV_WINDOWS'!P39","v":0}]
["Exterior Doors-Opaque, Swinging",{"$f":"IF('Project Info'!$C$8=\"\", \"Select climate zone on 'Project Info' tab\", IF('Project Info'!$C$5=\"ASHRAE 90.1-2007\", 'Prescriptive Tables 1, 2 & 3'!C89,'Prescriptive Tables 1, 2 & 3'!D89))","v":"Select climate zone on 'Project Info' tab"},null,null,{"$f":"'3.5 - ENV_EXTERIOR DOORS'!G37","v":0},{"$f":"'3.5 - ENV_EXTERIOR DOORS'!J37","v":0},{"$f":"'3.5 - ENV_EXTERIOR DOORS'!M37","v":0}]
["HEATING & COOLING","The Heating and Cooling measures listed below must comply with ASHRAE Standard 90.1-2007 Section 6.4 in addition to the listed requirements below."]
["Space Heating - Type & Efficiency","Gas Heat: One or two 80% Et or 82% Ec Natural Gas Boiler(s), check ASHRAE Table 6.8\nElectric Heat: PTHP, 2.81 COP, electric resistance back-up at <40F\nFor spaces that are heat-only: May use warm-air furnace, based on predominant building heating source",null,null,{"$f":"'5.1, 5.3 - HEATING'!H46","v":0},{"$f":"'5.1, 5.3 - HEATING'!M46","v":0},{"$f":"'5.1, 5.3 - HEATING'!P46","v":0}]
["Pipe Freeze Protection & Ice/Snow Melt Systems","No energy use in Baseline",null,null,{"$f":"'5.1, 5.3 - HEATING'!H47","v":0},{"$f":"'5.1, 5.3 - HEATING'!M47","v":0},{"$f":"'5.1, 5.3 - HEATING'!P47","v":0}]
["Space Heating Distribution -Fan Power","Gas Heat: hydronic and 0.0003 kW/CFM PTAC \nElectric Heat: 0.0003 kW/CFM PTHP",null,null,{"$f":"'5.1, 5.3 - HEATING'!H49","v":0},{"$f":"'5.1, 5.3 - HEATING'!M49","v":0},{"$f":"'5.1, 5.3 - HEATING'!P49","v":0}]
["Space Heating - Sizing","Enter baseline capacity as calculated by energy modeling software. Per Appendix G, Section G3.1.2.2, unmet load hours shall not exceed 300 hours and 25% oversizing is allowed for sizing baseline heating systems.\n",null,null,{"$f":"'5.1, 5.3 - HEATING'!H48","v":0},{"$f":"'5.1, 5.3 - HEATING'!M48","v":0},{"$f":"'5.1, 5.3 - HEATING'!P48","v":0}]
["Space Heating - Design Temperatures","Per Appendix G, Section G3.1.3.3:\nHot Water Design Supply Temperature: 180F\nHot Water Design Return Temperature: 130F",null,null,{"$f":"'5.1, 5.3 - HEATING'!H50","v":0},{"$f":"'5.1, 5.3 - HEATING'!M50","v":0},{"$f":"'5.1, 5.3 - HEATING'!P50","v":0}]
["Space Heating - Controls","\nPer Appendix G, Section G3.1.3.4:\nOutdoor reset: 180F at 20F and below, 150F at 50F and above.",null,null,{"$f":"'5.1, 5.3 - HEATING'!H51","v":0},{"$f":"'5.1, 5.3 - HEATING'!M51","v":0},{"$f":"'5.1, 5.3 - HEATING'!P51","v":0}]
["Thermostat Setting","Heating: 70/72\nCooling: 78/80",{"$f":"B41","v":"Heating: 70/72\nCooling: 78/80"},null,"N/A","N/A","N/A"]
["Space Cooling - Type and Efficiency","Gas Heat: PTAC, 9.305 EER\nElectric Heat: PTHP, 9.105 EER",null,null,{"$f":"'5.2, 5.4 - COOLING'!G35","v":0},{"$f":"'5.2, 5.4 - COOLING'!N35","v":0},{"$f":"'5.2, 5.4 - COOLING'!Q35","v":0}]
["Space Cooling Distribution -Fan Power","0.0003 kW/CFM",null,null,{"$f":"'5.2, 5.4 - COOLING'!G37","v":0},{"$f":"'5.2, 5.4 - COOLING'!N37","v":0},{"$f":"'5.1, 5.3 - HEATING'!P55","v":0}]
["Space Cooling - Sizing","Enter baseline capacity as calculated by energy modeling software. Per Appendix G, Section G3.1.2.2, unmet load hours shall not exceed 300 hours and 15% oversizing is allowed for sizing baseline cooling systems.\n",null,null,{"$f":"'5.2, 5.4 - COOLING'!G36","v":0},{"$f":"'5.2, 5.4 - COOLING'!N36","v":0},{"$f":"'5.2, 5.4 - COOLING'!Q36","v":0}]
["Space Cooling - Controls","NA",null,null,{"$f":"'5.2, 5.4 - COOLING'!G38","v":0},{"$f":"'5.2, 5.4 - COOLING'!N38","v":0},{"$f":"'5.2, 5.4 - COOLING'!Q38","v":0}]
["LIGHTING "]
["Lighting Controls","Occupancy Sensors per 3.6.3.3 of the Simulation Guidelinesand ASHRAE 90.1",null,null,{"$f":"'6.1, 6.2, 6.3 - LIGHTING'!J97","v":0},{"$f":"'6.1, 6.2, 6.3 - LIGHTING'!K97","v":0},{"$f":"'6.1, 6.2, 6.3 - LIGHTING'!N97","v":0}]
["Common Area Lighting",{"$f":"IF('Project Info'!C5=\"ASHRAE 90.1-2007\", ERMs!M48, ERMs!N48)","v":"ASHRAE 90.1-2010 Baseline LPD's\nLobby: 0.9 W/Sf\nCorridor: 0.66 W/Sf\nStairs: 0.69 W/Sf\nElevator: 0.9 W/Sf\nStorage, Active: 0.63 W/Sf\nStorage, Inactive: 0.63 W/Sf\nRestroom: 0.98 W/Sf\nOffice: 1.11 W/Sf\nMultipurpose: 1.23 W/Sf\nElec/Mech: 0.95 W/Sf\nGarage: 0.19 W/Sf"},null,null,{"$f":"'6.1, 6.2, 6.3 - LIGHTING'!J98","v":0},{"$f":"'6.1, 6.2, 6.3 - LIGHTING'!K98","v":0},{"$f":"'6.1, 6.2, 6.3 - LIGHTING'!N98","v":0},null,null,null,null,null,"ASHRAE 90.1-2007 Baseline LPD's\nLobby: 1.3 W/Sf\nCorridor: 0.5 W/Sf\nStairs: 0.6 W/Sf\nElevator: 1.3 W/Sf\nStorage, Active: 0.8 W/Sf\nStorage, Inactive: 0.3 W/Sf\nRestroom: 0.9 W/Sf\nOffice: 1.1 W/Sf\nMultipurpose: 1.3 W/Sf\nElec/Mech: 1.5 W/Sf\nGarage: 0.2 W/Sf","ASHRAE 90.1-2010 Baseline LPD's\nLobby: 0.9 W/Sf\nCorridor: 0.66 W/Sf\nStairs: 0.69 W/Sf\nElevator: 0.9 W/Sf\nStorage, Active: 0.63 W/Sf\nStorage, Inactive: 0.63 W/Sf\nRestroom: 0.98 W/Sf\nOffice: 1.11 W/Sf\nMultipurpose: 1.23 W/Sf\nElec/Mech: 0.95 W/Sf\nGarage: 0.19 W/Sf"]
["Exit Signs","5 W/face, # signs",null,null,{"$f":"'6.1, 6.2, 6.3 - LIGHTING'!J100","v":0},{"$f":"'6.1, 6.2, 6.3 - LIGHTING'!K100","v":0},{"$f":"'6.1, 6.2, 6.3 - LIGHTING'!N100","v":0}]
["Exterior Lights","ASHRAE 90.1 Baseline Watts, with photo sensors",null,null,{"$f":"'6.1, 6.2, 6.3 - LIGHTING'!J101","v":0},{"$f":"'6.1, 6.2, 6.3 - LIGHTING'!K101","v":0},{"$f":"'6.1, 6.2, 6.3 - LIGHTING'!N101","v":0}]
["In-Unit Lighting",{"$f":"IF('Project Info'!C12=\"Yes\", \"0.7 W/Sf\", \"1.1 W/Sf\")","v":"1.1 W/Sf"},null,null,{"$f":"'6.1, 6.2, 6.3 - LIGHTING'!J104","v":0},{"$f":"'6.1, 6.2, 6.3 - LIGHTING'!K104","v":0},{"$f":"'6.1, 6.2, 6.3 - LIGHTING'!N104","v":0}]
["MOTORS (3-PHASE , > 1 HP)"]
["Heating Circulating Pumps","NEMA Standard motors, 19W/GPM (hot-water), no VFD (unless over 120,000 SF);\n22W/GPM (chilled-water)",null,null,{"$f":"'7.1 - MOTORS'!H34","v":0},{"$f":"'7.1 - MOTORS'!J34","v":0},{"$f":"'7.1 - MOTORS'!M34","v":0}]
["Cooling Circulating Pumps and Cooling Tower Fans","NEMA Standard motors, 19W/GPM (hot-water), no VFD (unless over 120,000 SF);\n22W/GPM (chilled-water)",null,null,{"$f":"'7.1 - MOTORS'!H36","v":0},{"$f":"'7.1 - MOTORS'!J36","v":0},{"$f":"'7.1 - MOTORS'!M36","v":0}]
["DHW Circulating Pumps","Use system parameters (head, efficiency) or Ppump=BHP*746/Pump Motor Efficiency to model pump power. Use ASHRAE Table 10.8 to determine Motor Efficiency",null,null,{"$f":"'7.1 - MOTORS'!H36","v":0},{"$f":"'7.1 - MOTORS'!J36","v":0},{"$f":"'7.1 - MOTORS'!M36","v":0}]
["VENTILATION"]
["Ventilation: System Type & Rates\n(Apartments and Common Areas)","Apartment: Same as Proposed or As-Built, but not to exceed ASHRAE 62.2-2007 rates by more than 50%\n ## CFM / bath, ## CFM / kitchen, ## CFM / unit\nCommon Space: Same as Proposed or As-Built, but not to exceed ASHRAE 62.1-2007 rates by more than 50%",null,null,{"$f":"'8.2 - VENT_SCHEDULE&TAB REPORT'!H56","v":0},{"$f":"'8.2 - VENT_SCHEDULE&TAB REPORT'!O56","v":0},{"$f":"'8.2 - VENT_SCHEDULE&TAB REPORT'!R56","v":0}]
["Ventilation: Thermal\n(Heat Recovery)","No Heat Recovery Required",null,null,{"$f":"'8.2 - VENT_SCHEDULE&TAB REPORT'!H58","v":0},{"$f":"'8.2 - VENT_SCHEDULE&TAB REPORT'!O58","v":0},{"$f":"'8.2 - VENT_SCHEDULE&TAB REPORT'!R58","v":0}]
["Ventilation: Thermal\n(Duct Sealing)","Add 5 CFM per floor per shaft and 5 CFM per register per shaft to Exhaust CFM to represent ventilation duct leakage for central systems: ## CFM",null,null,{"$f":"'8.2 - VENT_SCHEDULE&TAB REPORT'!H33","v":0},{"$f":"'8.2 - VENT_SCHEDULE&TAB REPORT'!O33","v":0},{"$f":"'8.2 - VENT_SCHEDULE&TAB REPORT'!R33","v":0}]
["Whole-House Ventilation: Electric (Apartments)","0 kW\nFan power associated with whole-house ventilation is already included in the HVAC Supply Fan Power",null,null,{"$f":"'8.2 - VENT_SCHEDULE&TAB REPORT'!H53","v":0},{"$f":"'8.2 - VENT_SCHEDULE&TAB REPORT'!O53","v":0},{"$f":"'8.2 - VENT_SCHEDULE&TAB REPORT'!R53","v":0}]
["Local Exhaust Ventilation: Electric (Apartments)","## kW\nFan power exclusively for local exhaust, can be added to the Baseline, using these rates\nCeiling Exhaust: 1.2 CFM/W\nRange hoods & Inline Exhaust: 2.3 CFM/W",null,null,{"$f":"'8.2 - VENT_SCHEDULE&TAB REPORT'!H54","v":0},{"$f":"'8.2 - VENT_SCHEDULE&TAB REPORT'!O54","v":0},{"$f":"'8.2 - VENT_SCHEDULE&TAB REPORT'!R54","v":0}]
["Ventilation: Electric\n(Non-Apartment)","## kW\nUse Pfan=BHP*746/Fan Motor Efficiency to determine ventilation fan power. Use ASHRAE Table 10.8 to determine Fan Motor Efficiency",null,null,{"$f":"'8.2 - VENT_SCHEDULE&TAB REPORT'!H52","v":0},{"$f":"'8.2 - VENT_SCHEDULE&TAB REPORT'!O52","v":0},{"$f":"'8.2 - VENT_SCHEDULE&TAB REPORT'!R52","v":0}]
["Ventilation: Demand  Control","No demand control on any ventilation system.",null,null,{"$f":"'8.2 - VENT_SCHEDULE&TAB REPORT'!H57","v":0},{"$f":"'8.2 - VENT_SCHEDULE&TAB REPORT'!O57","v":0},{"$f":"'8.2 - VENT_SCHEDULE&TAB REPORT'!R57","v":0}]
["Ventilation: Thermal & Electric\n(Garage Exhaust fan)","## kW\nUse Pfan=BHP*746/Fan Motor Efficiency to determine ventilation fan power. Use ASHRAE Table 10.8 to determine Fan Motor Efficiency",null,null,{"$f":"'8.2 - VENT_SCHEDULE&TAB REPORT'!H60","v":0},{"$f":"'8.2 - VENT_SCHEDULE&TAB REPORT'!O60","v":0},{"$f":"'8.2 - VENT_SCHEDULE&TAB REPORT'!R60","v":0}]
["MISC."]
["Renewables","NA"]
["CHP","NA"]

{"sheet":"Prerequisites Checklist","index":5,"n_rows":123,"n_cols":18,"rows_kept":123,"cut":false,"hidden":false,"merged":[[26,1,45,1],[11,1,16,1],[19,1,20,1],[1,1,1,5],[2,1,2,5],[7,3,7,4],[122,1,122,5],[121,1,121,5],[64,1,66,1],[54,1,56,1],[61,1,63,1],[78,1,81,1],[99,1,100,1],[102,1,103,1],[82,1,84,1],[116,1,117,1],[91,1,96,1],[67,1,75,1],[85,1,90,1]]}
[null,"Instructions"]
[null,"1) For Performance Path projects, this Worksheet confirms all requirements of the prerequisites have been met or exceeded."]
[null,"2) Complete all T&V Worksheets and this checklist will be automatically updated."]
[null,"3) Review the checklist and add clarification in the Comments column for any items that have not been verified or are not applicable."]
[null,"4) Submit to EPA twice, once after all Prerequisites have been verified in design and again after the final inspection."]
[]
[]
[null,{"$f":"'Project Info'!C3&\" Prerequisites Checklist\"","v":" Prerequisites Checklist"},null,"<Select One - Plan Review or Final Inspection>"]
[]
[null,"Component","Prerequisite Checklist\nThe proposed design shall AT LEAST meet each of these requirements for each indicated measure or system, or applicable Local, State, or National codes, whichever is more stringent.","Location in Specs/ DWGs","Verified in Plan Review","Verified by Inspector","Explanation for N/A or Non-Verified Requirements",null,null,null,null,null,null,null,null,null,"EPA Multifamily Highrise Program - Unique Performance Path Requirements","NYSERDA Multifamily Performance Program - Unique Performance Path Requirements"]
[null,"1.  Appliances"]
[null,"(a)  Appliances","When provided in common areas and/or apartments, refrigerators, dishwashers, clothes washers, ceiling fans and vending machines must be ENERGY STAR certified.","-","-","-","-"]
[null,null,{"$f":"'1.1 - APPLIANCES'!D26","v":"Refrigerators"},{"$f":"'1.1 - APPLIANCES'!M26","v":0},{"$f":"'1.1 - APPLIANCES'!N26","v":0},{"$f":"'1.1 - APPLIANCES'!O26","v":0},null,{"$f":"IF($D$8=\"<Select One - Plan Review or Final Inspection>\",\"See instructions in cell D8\",IF($D$8=\"Plan Review\",(IF(E13=\"No\",IF(G13=\"\",\"Provide explanation for Non-Verified Requirements\", \"\"),IF(E13=\"NA\",IF(G13=\"\",\"Provide explanation for this NA item\",\"\"),IF(E13=0,IF(G13=\"\",\"Provide information in corresponding worksheet. Identify as Y, N or NA.\"),\"\")))),IF($D$8=\"Final Inspection\",(IF(F13=\"No\",IF(G13=\"\",\"Provide explanation for Non-Verified Requirements\", \"\"),IF(F13=\"NA\",IF(G13=\"\",\"Provide explanation for this NA item\",\"\"),IF(F13=0,IF(G13=\"\",\"Provide information in corresponding worksheet. Identify as Y, N or NA.\", \"\"),\"\")))))))","v":"See instructions in cell D8"}]
[null,null,{"$f":"'1.1 - APPLIANCES'!D27","v":"Dishwashers"},{"$f":"'1.1 - APPLIANCES'!M27","v":0},{"$f":"'1.1 - APPLIANCES'!N27","v":0},{"$f":"'1.1 - APPLIANCES'!O27","v":0},null,{"$f":"IF($D$8=\"<Select One - Plan Review or Final Inspection>\",\"See instructions in cell D8\",IF($D$8=\"Plan Review\",(IF(E14=\"No\",IF(G14=\"\",\"Provide explanation for Non-Verified Requirements\", \"\"),IF(E14=\"NA\",IF(G14=\"\",\"Provide explanation for this NA item\",\"\"),IF(E14=0,IF(G14=\"\",\"Provide information in corresponding worksheet. Identify as Y, N or NA.\"),\"\")))),IF($D$8=\"Final Inspection\",(IF(F14=\"No\",IF(G14=\"\",\"Provide explanation for Non-Verified Requirements\", \"\"),IF(F14=\"NA\",IF(G14=\"\",\"Provide explanation for this NA item\",\"\"),IF(F14=0,IF(G14=\"\",\"Provide information in corresponding worksheet. Identify as Y, N or NA.\", \"\"),\"\")))))))","v":"See instructions in cell D8"}]
[null,null,{"$f":"'1.1 - APPLIANCES'!D28","v":"Clothes Washers"},{"$f":"'1.1 - APPLIANCES'!M28","v":0},{"$f":"'1.1 - APPLIANCES'!N28","v":0},{"$f":"'1.1 - APPLIANCES'!O28","v":0},null,"See instructions in cell D8"]
[null,null,{"$f":"'1.1 - APPLIANCES'!D29","v":"Ceiling fans"},{"$f":"'1.1 - APPLIANCES'!M29","v":0},{"$f":"'1.1 - APPLIANCES'!N29","v":0},{"$f":"'1.1 - APPLIANCES'!O29","v":0},null,"See instructions in cell D8"]
[null,null,{"$f":"'1.1 - APPLIANCES'!D30","v":"Vending Machines"},{"$f":"'1.1 - APPLIANCES'!M30","v":0},{"$f":"'1.1 - APPLIANCES'!N30","v":0},{"$f":"'1.1 - APPLIANCES'!O30","v":0},null,"See instructions in cell D8"]
[null,"2.  Domestic Water Heating"]
[null,"(a) General","Domestic water heating systems must comply with ASHRAE Standard 90.1-2007 Section 7.4.",{"$f":"'2.1-2.2 - DOMESTIC HOT WATER'!M46","v":0},{"$f":"'2.1-2.2 - DOMESTIC HOT WATER'!N46","v":0},{"$f":"'2.1-2.2 - DOMESTIC HOT WATER'!O46","v":0},null,"See instructions in cell D8"]
[null,"(b) Water Heating Type",{"$f":"IF('Project Info'!$C$12=\"\",\"<Confirm if project is participating in NYSERDA MPP on Project Info tab>\",IF('Project Info'!$C$12=\"Yes\",R20,Q20))","v":"<Confirm if project is participating in NYSERDA MPP on Project Info tab>"},{"$f":"'2.1-2.2 - DOMESTIC HOT WATER'!M48","v":0},{"$f":"'2.1-2.2 - DOMESTIC HOT WATER'!N48","v":0},{"$f":"'2.1-2.2 - DOMESTIC HOT WATER'!O48","v":0},null,"See instructions in cell D8",null,null,null,null,null,null,null,null,"Atmospherically vented gas water heaters, tankless coils and side-arm water heaters shall not be specified. Indirect water heaters, with or without storage, are acceptable. \n","Domestic water heating equipment shall be ENERGY STAR certified, where applicable. Atmospherically vented gas water heaters, tankless coils and side-arm water heaters shall not be specified. Indirect water heaters, with or without storage, are acceptable. "]
[null,null,"If storage is provided, the maximum storage tank capacity shall be specified based on occupancy.",{"$f":"'2.1-2.2 - DOMESTIC HOT WATER'!M49","v":0},{"$f":"'2.1-2.2 - DOMESTIC HOT WATER'!N49","v":0},{"$f":"'2.1-2.2 - DOMESTIC HOT WATER'!O49","v":0},null,"See instructions in cell D8"]
[null,"(c) Water Heating Temperature","The temperature setting of in-unit storage water heaters must not exceed 140°F. For both in-unit and central DHW systems, temperatures measured at faucets and showerheads must not exceed 125°F.",{"$f":"'2.1-2.2 - DOMESTIC HOT WATER'!M54","v":0},{"$f":"'2.1-2.2 - DOMESTIC HOT WATER'!N54","v":0},{"$f":"'2.1-2.2 - DOMESTIC HOT WATER'!O54","v":0},null,"See instructions in cell D8"]
[null,"(d) Water Heating Controls","When mixing valves are specified to control hot water temperature for central domestic water heating systems serving apartments, electronic mixing valves shall be used.",{"$f":"'2.1-2.2 - DOMESTIC HOT WATER'!M55","v":0},{"$f":"'2.1-2.2 - DOMESTIC HOT WATER'!N55","v":0},{"$f":"'2.1-2.2 - DOMESTIC HOT WATER'!O55","v":0},null,"See instructions in cell D8"]
[null,"(e) Water Heating Pipe Insulation","Piping carrying liquid with temperatures greater than 105°F must have a minimum of 1” of insulation. Pipes 1.5” in diameter and greater must have a minimum of 1.5” of insulation. Extent and location to be determined by ASHRAE 90.1-2007 Section 7.4.3 or local code.",{"$f":"'2.1-2.2 - DOMESTIC HOT WATER'!M53","v":0},{"$f":"'2.1-2.2 - DOMESTIC HOT WATER'!N53","v":0},{"$f":"'2.1-2.2 - DOMESTIC HOT WATER'!O53","v":0},null,"See instructions in cell D8"]
[null,"(f) Plumbing Fixtures","• The average flow rate for all faucets must be ≤ 2.0 gallons per minute (as rated at 80 psi). \n• If flow ratings at 80 psi are not available, WaterSense labeled faucets or aerators may be used to meet this prerequisite. \n• All showerheads must be WaterSense labeled\n• All tank-type toilets must be WaterSense labeled.",{"$f":"'2.1-2.2 - DOMESTIC HOT WATER'!M50","v":0},{"$f":"'2.1-2.2 - DOMESTIC HOT WATER'!N50","v":0},{"$f":"'2.1-2.2 - DOMESTIC HOT WATER'!O50","v":0},null,"See instructions in cell D8"]
[null,"3.  Envelope"]
[null,"(a) General","Assembly U-value determinations must follow ASHRAE 90.1-2007 Appendix A.","-","-","-","-","See instructions in cell D8"]
[null,null,"• Below Grade Walls",{"$f":"'3.1 - ENV_BELOW GRADE WALLS'!$G$45","v":0},{"$f":"'3.1 - ENV_BELOW GRADE WALLS'!$H$45","v":0},{"$f":"'3.1 - ENV_BELOW GRADE WALLS'!$I$45","v":0},null,"See instructions in cell D8"]
[null,null,"• Above Grade Walls",{"$f":"'3.1 - ENV_ABOVE GRADE WALLS'!$G$61","v":0},{"$f":"'3.1 - ENV_ABOVE GRADE WALLS'!$H$61","v":0},{"$f":"'3.1 - ENV_ABOVE GRADE WALLS'!$I$61","v":0},null,"See instructions in cell D8"]
[null,null,"• Floor Perimeter/ Plank Edges",{"$f":"'3.1 - ENV_ABOVE GRADE WALLS'!$G$63","v":0},{"$f":"'3.1 - ENV_ABOVE GRADE WALLS'!$H$63","v":0},{"$f":"'3.1 - ENV_ABOVE GRADE WALLS'!$I$63","v":0},null,"See instructions in cell D8"]
[null,null,"• Roof",{"$f":"'3.2 - ENV_ROOF'!$G$46","v":0},{"$f":"'3.2 - ENV_ROOF'!$H$46","v":0},{"$f":"'3.2 - ENV_ROOF'!$I$46","v":0},null,"See instructions in cell D8"]
[null,null,"• Floors Over Unconditioned Spaces",{"$f":"'3.3 - ENV_FLOORS'!$G$34","v":0},{"$f":"'3.3 - ENV_FLOORS'!$H$34","v":0},{"$f":"'3.3 - ENV_FLOORS'!$I$34","v":0},null,"See instructions in cell D8"]
[null,null,"• Below Grade Slab Floors",{"$f":"'3.3 - ENV_FLOORS'!$G$44","v":0},{"$f":"'3.3 - ENV_FLOORS'!$H$44","v":0},{"$f":"'3.3 - ENV_FLOORS'!$I$44","v":0},null,"See instructions in cell D8"]
[null,null,"• Slab-On-Grade Floors (unheated Only)",{"$f":"'3.3 - ENV_FLOORS'!$G$54","v":0},{"$f":"'3.3 - ENV_FLOORS'!$H$54","v":0},{"$f":"'3.3 - ENV_FLOORS'!$I$54","v":0},null,"See instructions in cell D8"]
[null,null,"• Slab-On-Grade Floors (embedded heated Only)",{"$f":"'3.3 - ENV_FLOORS'!$G$64","v":0},{"$f":"'3.3 - ENV_FLOORS'!$H$64","v":0},{"$f":"'3.3 - ENV_FLOORS'!$I$64","v":0},null,"See instructions in cell D8"]
[null,null," The envelope components must comply with ASHRAE Standard 90.1-2007 Section 5.4. \n\nAll roof, wall, floor and slab insulation shall achieve RESNET-defined Grade I installation or, alternatively, Grade II for surfaces that contain a layer of continuous, air impermeable insulation (≥R-3 in CZ 1-4 and ≥R-5 in CZ 5-8).","-","-","-","-"]
[null,null,"• Below Grade Walls",{"$f":"'3.1 - ENV_BELOW GRADE WALLS'!$G$50","v":0},{"$f":"'3.1 - ENV_BELOW GRADE WALLS'!$H$50","v":0},{"$f":"'3.1 - ENV_BELOW GRADE WALLS'!$I$50","v":0},null,"See instructions in cell D8"]
[null,null,"• Above Grade Walls",{"$f":"'3.1 - ENV_ABOVE GRADE WALLS'!$G$66","v":0},{"$f":"'3.1 - ENV_ABOVE GRADE WALLS'!$H$66","v":0},{"$f":"'3.1 - ENV_ABOVE GRADE WALLS'!$I$65","v":0},null,"See instructions in cell D8"]
[null,null,"• Floor Perimeter/ Plank Edges",{"$f":"'3.1 - ENV_ABOVE GRADE WALLS'!$G$67","v":0},{"$f":"'3.1 - ENV_ABOVE GRADE WALLS'!$H$67","v":0},{"$f":"'3.1 - ENV_ABOVE GRADE WALLS'!$I$67","v":0},null,"See instructions in cell D8"]
[null,null,"• Roof",{"$f":"'3.2 - ENV_ROOF'!$G$49","v":0},{"$f":"'3.2 - ENV_ROOF'!$H$49","v":0},{"$f":"'3.2 - ENV_ROOF'!$I$49","v":0},null,"See instructions in cell D8"]
[null,null,"• Floors Over Unconditioned Spaces",{"$f":"'3.3 - ENV_FLOORS'!$G$68","v":0},{"$f":"'3.3 - ENV_FLOORS'!$H$68","v":0},{"$f":"'3.3 - ENV_FLOORS'!$I$68","v":0},null,"See instructions in cell D8"]
[null,null,"• Below Grade Slab Floors",{"$f":"'3.3 - ENV_FLOORS'!$G$69","v":0},{"$f":"'3.3 - ENV_FLOORS'!$H$69","v":0},{"$f":"'3.3 - ENV_FLOORS'!$I$69","v":0},null,"See instructions in cell D8"]
[null,null,"• Slab-On-Grade Floors (unheated Only)",{"$f":"'3.3 - ENV_FLOORS'!$G$70","v":0},{"$f":"'3.3 - ENV_FLOORS'!$H$70","v":0},{"$f":"'3.3 - ENV_FLOORS'!$I$70","v":0},null,"See instructions in cell D8"]
[null,null,"• Slab-On-Grade Floors (embedded heated Only)",{"$f":"'3.3 - ENV_FLOORS'!$G$71","v":0},{"$f":"'3.3 - ENV_FLOORS'!$H$71","v":0},{"$f":"'3.3 - ENV_FLOORS'!$I$71","v":0},null,"See instructions in cell D8"]
[null,null,"• Exterior Doors",{"$f":"'3.5 - ENV_EXTERIOR DOORS'!J37","v":0},{"$f":"'3.5 - ENV_EXTERIOR DOORS'!K37","v":0},{"$f":"'3.5 - ENV_EXTERIOR DOORS'!L37","v":0},null,"See instructions in cell D8"]
[null,null,"For steel-framed and metal building walls, continuous exterior insulation (≥R-3) is required on above grade walls17. For mass or masonry walls with metal framing, continuous interior or exterior insulation (≥R-3) is required on above grade walls.\n\nProjected balconies are currently exempt, however, EPA recommends that they are thermally broken.",{"$f":"'3.1 - ENV_ABOVE GRADE WALLS'!G68","v":0},{"$f":"'3.1 - ENV_ABOVE GRADE WALLS'!H68","v":0},{"$f":"'3.1 - ENV_ABOVE GRADE WALLS'!I68","v":0},null,"See instructions in cell D8"]
[null,"(b) Vertical Glazing",{"$f":"IF('Project Info'!$C$12=\"\",\"<Confirm if project is participating in NYSERDA MPP on Project Info tab>\",IF('Project Info'!$C$12=\"Yes\",R47,Q47))","v":"<Confirm if project is participating in NYSERDA MPP on Project Info tab>"},{"$f":"'3.4 - ENV_WINDOWS'!M39","v":0},{"$f":"'3.4 - ENV_WINDOWS'!N39","v":0},{"$f":"'3.4 - ENV_WINDOWS'!O39","v":0},null,"See instructions in cell D8",null,null,null,null,null,null,null,null,"Specified windows must be double or triple-pane, with low-emissivity glass or coatings.","Specified windows must be double or triple-pane, with low-emissivity glass or coatings. \n\nWindow frames must be separated from conductive framing (metal & masonry studs, lintels & sills) with insulation designed to serve as a thermal break."]
[null,"(c) Vestibules","When required by local building code, entranceways shall be designed with vestibules with weather-stripping hard-fastened to the door or frame.",{"$f":"'3.5 - ENV_EXTERIOR DOORS'!J38","v":0},{"$f":"'3.5 - ENV_EXTERIOR DOORS'!K38","v":0},{"$f":"'3.5 - ENV_EXTERIOR DOORS'!L38","v":0},null,"See instructions in cell D8"]
[null,"(d) AC Sleeves","If installing sleeves for through-wall AC units, insulated covers must be provided by the building for use during heating season and when AC units are not installed.",{"$f":"'5.2, 5.4 - COOLING'!N57","v":0},{"$f":"'5.2, 5.4 - COOLING'!O57","v":0},{"$f":"'5.2, 5.4 - COOLING'!P57","v":0},null,"See instructions in cell D8"]
[null,"4. Garages and Sidewalks"]
[null,"(a) Air Infiltration","Attached garages shall be fully compartmentalized from the rest of the building through air sealing.  All pipe and conduit penetrations shall be sealed with material compatible with the surface and resilient to temperature fluctuations.",{"$f":"'4.1 - GARAGES_CMPTZ & HEATING '!G25","v":0},{"$f":"'4.1 - GARAGES_CMPTZ & HEATING '!H25","v":0},{"$f":"'4.1 - GARAGES_CMPTZ & HEATING '!I25","v":0},null,"See instructions in cell D8"]
[null,"(b) Pipe Freeze Protection","Garages, including plenums and dropped ceilings within the garage, shall not be heated for comfort or to prevent pipes from freezing.  Piping design and layout shall locate piping within conditioned spaces or grouped and properly insulated to prevent freezing. If heat tracing is used for freeze protection, it must be activated based on pipe wall temperature, rather than air temperature, and the energy consumption must be modeled in the As-Built (but excluded in the Baseline). The heat tracing thermostat set point must be no higher than 40°F and the set point must be confirmed by a field inspection.",{"$f":"'4.1 - GARAGES_CMPTZ & HEATING '!G23","v":0},{"$f":"'4.1 - GARAGES_CMPTZ & HEATING '!H23","v":0},{"$f":"'4.1 - GARAGES_CMPTZ & HEATING '!I23","v":0},null,"See instructions in cell D8"]
[null,"(c) Ice Prevention","Radiant heating, either wall or ceiling-mounted or within the garage floor (or sidewalks) may be used to prevent ice formation on the ground as a safety feature only and temperature-based controls must comply with ASHRAE 90.1-2007 Section 6.4.3.8. Energy consumption associated with these systems must be modeled in the As-Built (but excluded in the Baseline).",{"$f":"'4.1 - GARAGES_CMPTZ & HEATING '!G24","v":0},{"$f":"'4.1 - GARAGES_CMPTZ & HEATING '!H24","v":0},{"$f":"'4.1 - GARAGES_CMPTZ & HEATING '!I24","v":0},null,"See instructions in cell D8"]
[null,"5. Heating and Cooling"]
[null,"(a) General","The heating and cooling systems must comply with ASHRAE 90.1-2007 Section 6.4.","-","-","-","-"]
[null,null,"• Heating",{"$f":"'5.1, 5.3 - HEATING'!M44","v":0},{"$f":"'5.1, 5.3 - HEATING'!N44","v":0},{"$f":"'5.1, 5.3 - HEATING'!O44","v":0},null,"See instructions in cell D8"]
[null,null,"• Cooling",{"$f":"'5.2, 5.4 - COOLING'!N33","v":0},{"$f":"'5.2, 5.4 - COOLING'!O33","v":0},{"$f":"'5.2, 5.4 - COOLING'!P33","v":0},null,"See instructions in cell D8"]
[null,"(b) Heating System Type",{"$f":"IF('Project Info'!$C$12=\"\",\"<Confirm if project is participating in NYSERDA MPP on Project Info tab>\",IF('Project Info'!$C$12=\"Yes\",R58,Q58))","v":"<Confirm if project is participating in NYSERDA MPP on Project Info tab>"},{"$f":"'5.1, 5.3 - HEATING'!M46","v":0},{"$f":"'5.1, 5.3 - HEATING'!N46","v":0},{"$f":"'5.1, 5.3 - HEATING'!O46","v":0},null,"See instructions in cell D8",null,null,null,null,null,null,null,null,"Atmospherically vented gas furnaces and boilers shall not be specified.","Heating equipment shall be ENERGY STAR certified, where applicable. Atmospherically vented gas furnaces and boilers shall not be specified. "]
[null,"(c) Heating System Sizing","Load sizing calculations that reflect the design; installed capacity cannot exceed design by more than 20%, except when smaller sizes are not available.\n\nHeating loads shall be calculated, equipment capacity shall be selected, and duct systems shall be sized according to the latest editions of ACCA Manual J, S, & D, respectively, ASHRAE 2009 Handbook of Fundamentals, or a substantively equivalent procedure. Indoor temperatures shall be 70°F for heating, outdoor temperatures shall be the 99.0% design temperature, as published by the ASHRAE Handbook of Fundamentals.",{"$f":"'5.1, 5.3 - HEATING'!M48","v":0},{"$f":"'5.1, 5.3 - HEATING'!N48","v":0},{"$f":"'5.1, 5.3 - HEATING'!O48","v":0},null,"See instructions in cell D8"]
[null,"(d) Cooling System Type",{"$f":"IF('Project Info'!$C$12=\"\",\"<Confirm if project is participating in NYSERDA MPP on Project Info tab>\",IF('Project Info'!$C$12=\"Yes\",R60,Q60))","v":"<Confirm if project is participating in NYSERDA MPP on Project Info tab>"},{"$f":"'5.2, 5.4 - COOLING'!N35","v":0},{"$f":"'5.2, 5.4 - COOLING'!O35","v":0},{"$f":"'5.2, 5.4 - COOLING'!P35","v":0},null,"See instructions in cell D8",null,null,null,null,null,null,null,null,"NA","Cooling equipment shall be ENERGY STAR certified, where applicable."]
[null,"(e) Cooling System Sizing","Load sizing calculations must reflect the design; installed capacity cannot exceed design by more than 20%, except when smaller sizes are not available.\n\nCooling loads shall be calculated, equipment capacity shall be selected, and duct systems shall be sized according to the latest editions of ACCA Manual J, S, & D, respectively, ASHRAE 2009 Handbook of Fundamentals, or a substantively equivalent procedure. Indoor temperatures shall be 75°F for cooling, outdoor temperatures shall be the 1.0% design temperature, as published by the ASHRAE Handbook of Fundamentals.\n\n",{"$f":"'5.2, 5.4 - COOLING'!N36","v":0},{"$f":"'5.2, 5.4 - COOLING'!O36","v":0},{"$f":"'5.2, 5.4 - COOLING'!P36","v":0},null,"See instructions in cell D8"]
[null,"(f) Control Valves","For hydronic distribution systems, all terminal heating and cooling distribution equipment must be separated from the riser or distribution loop by a control valve or terminal distribution pump, so that heated or cooled fluid is not delivered to the apartment distribution equipment when there is no call from the apartment thermostats.","-","-","-","-"]
[null,null,"• Heating",{"$f":"'5.1, 5.3 - HEATING'!M58","v":0},{"$f":"'5.1, 5.3 - HEATING'!N58","v":0},{"$f":"'5.1, 5.3 - HEATING'!O58","v":0},null,"See instructions in cell D8"]
[null,null,"• Cooling",{"$f":"'5.2, 5.4 - COOLING'!N44","v":0},{"$f":"'5.2, 5.4 - COOLING'!O44","v":0},{"$f":"'5.2, 5.4 - COOLING'!P44","v":0},null,"See instructions in cell D8"]
[null,"(g) Flexible Ducts","Heating and cooling ductwork that is specified as flex duct shall follow the Sheet Metal and Air Conditioning Contractors’ (SMACNA) installation standards for flex ducts (see Appendix A of the Performance Path).","-","-","-","-"]
[null,null,"• Heating",{"$f":"'5.1, 5.3 - HEATING'!M61","v":0},{"$f":"'5.1, 5.3 - HEATING'!N61","v":0},{"$f":"'5.1, 5.3 - HEATING'!O61","v":0},null,"See instructions in cell D8"]
[null,null,"• Cooling",{"$f":"'5.2, 5.4 - COOLING'!N52","v":0},{"$f":"'5.2, 5.4 - COOLING'!O52","v":0},{"$f":"'5.2, 5.4 - COOLING'!P52","v":0},null,"See instructions in cell D8"]
[null,"(h) Duct Sealing and Insulation","Heating and cooling ductwork shall be sealed at all transverse joints and connections, including ductwork connections through drywall or other finish materials, using UL‐181 compliant methods and materials. Construction documents shall specify that ductwork must be inspected before access is covered up.","-","-","-","-"]
[null,null,"• Heating",{"$f":"'5.1, 5.3 - HEATING'!M63","v":0},{"$f":"'5.1, 5.3 - HEATING'!N63","v":0},{"$f":"'5.1, 5.3 - HEATING'!O63","v":0},null,"See instructions in cell D8"]
[null,null,"• Cooling",{"$f":"'5.2, 5.4 - COOLING'!N51","v":0},{"$f":"'5.2, 5.4 - COOLING'!O51","v":0},{"$f":"'5.2, 5.4 - COOLING'!P51","v":0},null,"See instructions in cell D8"]
[null,null,"Total duct leakage for in-unit systems shall be ≤8 CFM25 per 100 ft2 of conditioned floor area. Sampling procedures and tolerances are described in the T&V Worksheets. As an alternative to meeting total duct leakage requirements post-construction, total duct leakage measured at rough-in, ≤4 CFM25 per 100ft2, with air handler and all ductwork installed, is accepted.","-","-","-","-"]
[null,null,"• Heating",{"$f":"'5.1, 5.3 - HEATING'!M69","v":0},{"$f":"'5.1, 5.3 - HEATING'!N69","v":0},{"$f":"'5.1, 5.3 - HEATING'!O69","v":0},null,"See instructions in cell D8"]
[null,null,"• Cooling",{"$f":"'5.2, 5.4 - COOLING'!N53","v":0},{"$f":"'5.2, 5.4 - COOLING'!O53","v":0},{"$f":"'5.2, 5.4 - COOLING'!P53","v":0},null,"See instructions in cell D8"]
[null,null,{"$f":"IF('Project Info'!$C$12=\"\",\"<Confirm if project is participating in NYSERDA MPP on Project Info tab>\",IF('Project Info'!$C$12=\"Yes\",R74,Q74))","v":"<Confirm if project is participating in NYSERDA MPP on Project Info tab>"},"-","-","-","-",null,null,null,null,null,null,null,null,null,"Heating and cooling supply and return ductwork shall be insulated to a minimum R‐6 in unconditioned space.","Heating and cooling supply and return ductwork shall be insulated to a minimum R-4 in conditioned space, R-6 in unconditioned space and R-8 when located outside the building."]
[null,null,"• Heating",{"$f":"'5.1, 5.3 - HEATING'!M62","v":0},{"$f":"'5.1, 5.3 - HEATING'!N62","v":0},{"$f":"'5.1, 5.3 - HEATING'!O62","v":0},null,"See instructions in cell D8"]
[null,null,"• Cooling",{"$f":"'5.2, 5.4 - COOLING'!N49","v":0},{"$f":"'5.2, 5.4 - COOLING'!O49","v":0},{"$f":"'5.2, 5.4 - COOLING'!P49","v":0},null,"See instructions in cell D8"]
[null,"(i) Cooling Piping Insulation (Chilled water, brine and refrigerant piping)",{"$f":"IF('Project Info'!$C$12=\"\",\"<Confirm if project is participating in NYSERDA MPP on Project Info tab>\",IF('Project Info'!$C$12=\"Yes\",R77,Q77))","v":"<Confirm if project is participating in NYSERDA MPP on Project Info tab>"},{"$f":"'5.2, 5.4 - COOLING'!N43","v":0},{"$f":"'5.2, 5.4 - COOLING'!O43","v":0},{"$f":"'5.2, 5.4 - COOLING'!P43","v":0},null,"See instructions in cell D8",null,null,null,null,null,null,null,null,"Piping carrying fluid with temperatures less than 60°F must have a minimum of 0.5” of insulation. Pipes 1.5” in diameter and greater must have a minimum of 1.0” of insulation.  Construction documents must account for piping total thickness including required insulation when passing through planks or any other penetrations. For cooling systems that require branch pipe insulation, the insulation thickness must be considered when designing room dimensions and access chases. Construction documents shall specify that the piping must be inspected before access is covered up. Extent and location to be determined by ASHRAE 90.1-2007 Section 6.4.4.1.3 or local code.","Piping carrying fluid with temperatures less than 60°F shall be insulated in accordance with NYS ECCC.  Construction documents must account for piping total thickness including required insulation when passing through planks or any other penetrations. For cooling systems that require branch pipe insulation, the insulation thickness must be considered when designing room dimensions and access chases. Construction documents shall specify that the piping must be inspected before access is covered up. Extent and location to be determined by ASHRAE 90.1-2007 Section 6.4.4.1.3 or local code."]
[null,"(j) Heating Piping Insulation",{"$f":"IF('Project Info'!$C$12=\"\",\"<Confirm if project is participating in NYSERDA MPP on Project Info tab>\",IF('Project Info'!$C$12=\"Yes\",R78,Q78))","v":"<Confirm if project is participating in NYSERDA MPP on Project Info tab>"},{"$f":"'5.1, 5.3 - HEATING'!M54","v":0},{"$f":"'5.1, 5.3 - HEATING'!N54","v":0},{"$f":"'5.1, 5.3 - HEATING'!O54","v":0},null,{"$f":"IF($D$8=\"<Select One - Plan Review or Final Inspection>\",\"See instructions in cell D8\",IF($D$8=\"Plan Review\",(IF(E78=\"No\",IF(G78=\"\",\"Provide explanation for Non-Verified Requirements\", \"\"),IF(E78=\"NA\",IF(G78=\"\",\"Provide explanation for this NA item\",\"\"),IF(E78=0,IF(G78=\"\",\"Provide information in corresponding worksheet. Identify as Y, N or NA.\"),\"\")))),IF($D$8=\"Final Inspection\",(IF(F78=\"No\",IF(G78=\"\",\"Provide explanation for Non-Verified Requirements\", \"\"),IF(F78=\"NA\",IF(G78=\"\",\"Provide explanation for this NA item\",\"\"),IF(F78=0,IF(G78=\"\",\"Provide information in corresponding worksheet. Identify as Y, N or NA.\", \"\"),\"\")))))))","v":"See instructions in cell D8"},null,null,null,null,null,null,null,null,"Piping carrying fluid or steam with temperatures greater than 105°F must have a minimum of 1” of insulation. Pipes 1.5” in diameter and greater must have a minimum of 1.5” of insulation.  Construction documents must account for piping total thickness including required insulation when passing through planks or any other penetrations. For PTACs or any other heating systems that require branch pipe insulation, the insulation thickness must be considered when designing room dimensions and access chases. Construction documents shall specify that the piping must be inspected before access is covered up. Extent and location to be determined by ASHRAE 90.1-2007 Section 6.4.4.1.3 or local code.","Heating piping carrying fluid or steam with temperatures greater than 105°F shall be insulated in accordance with NYS ECCC. Construction documents must account for piping total thickness including required insulation when passing through planks or any other penetrations. For PTACs or any other heating systems that require branch pipe insulation, the insulation thickness must be considered when designing room dimensions and access chases. Construction documents shall specify that the piping must be inspected before access is covered up. Extent and location to be determined by ASHRAE 90.1-2007 Section 6.4.4.1.3 or local code."]
[null,"(k) Outside Air Dampers","For systems designed with outdoor-air supplied to the heating, cooling, or ventilation distribution system, provide motorized dampers that will automatically shut when systems or spaces are not in use.  Continuously running ventilation would not be subject to either damper, as they are always in use.","-","-","-","-"]
[null,null,"• Heating",{"$f":"'5.1, 5.3 - HEATING'!M60","v":0},{"$f":"'5.1, 5.3 - HEATING'!N60","v":0},{"$f":"'5.1, 5.3 - HEATING'!O60","v":0},null,"See instructions in cell D8"]
[null,null,"• Cooling",{"$f":"'5.2, 5.4 - COOLING'!N50","v":0},{"$f":"'5.2, 5.4 - COOLING'!O50","v":0},{"$f":"'5.2, 5.4 - COOLING'!P50","v":0},null,"See instructions in cell D8"]
[null,null,"• Ventilation",{"$f":"'8.2 - VENT_SCHEDULE&TAB REPORT'!O66","v":0},{"$f":"'8.2 - VENT_SCHEDULE&TAB REPORT'!P66","v":0},{"$f":"'8.2 - VENT_SCHEDULE&TAB REPORT'!Q66","v":0},null,"See instructions in cell D8"]
[null,"(l) Thermostats","Terminal heating and cooling distribution equipment serving an apartment shall be controlled by a thermostat(s) within the same apartment.","-","-","-","-"]
[null,null,"• Heating",{"$f":"'5.1, 5.3 - HEATING'!M72","v":0},{"$f":"'5.1, 5.3 - HEATING'!N72","v":0},{"$f":"'5.1, 5.3 - HEATING'!O72","v":0},null,"See instructions in cell D8"]
[null,null,"• Cooling",{"$f":"'5.2, 5.4 - COOLING'!N58","v":0},{"$f":"'5.2, 5.4 - COOLING'!O58","v":0},{"$f":"'5.2, 5.4 - COOLING'!P58","v":0},null,"See instructions in cell D8"]
[null,"(m) Hydronic Distribution Design","For hydronic distribution systems without automatic balancing valves, all supply/return headers must be designed in a “reverse return” configuration (i.e. first riser supplied is the last returned, etc.) and/or sized based on a water velocity of less than 4 ft/s.  Total pressure drop of terminal unit branch piping and fittings between a supply and return riser must be significantly greater than the total pressure drop from the top to the bottom of these risers.","-","-","-","-"]
[null,null,"• Heating",{"$f":"'5.1, 5.3 - HEATING'!M55","v":0},{"$f":"'5.1, 5.3 - HEATING'!N55","v":0},{"$f":"'5.1, 5.3 - HEATING'!O55","v":0},null,"See instructions in cell D8"]
[null,null,"• Cooling",{"$f":"'5.2, 5.4 - COOLING'!N40","v":0},{"$f":"'5.2, 5.4 - COOLING'!O40","v":0},{"$f":"'5.2, 5.4 - COOLING'!P40","v":0},null,"See instructions in cell D8"]
[null,null,"Calculations and assumptions for sizing circulating pumps must meet Chapter 43 of the ASHRAE Handbook, HVAC Systems and Equipment or equivalent industry accepted standard.","-","-","-","-"]
[null,null,"• Heating",{"$f":"'5.1, 5.3 - HEATING'!M56","v":0},{"$f":"'5.1, 5.3 - HEATING'!N56","v":0},{"$f":"'5.1, 5.3 - HEATING'!O56","v":0},null,"See instructions in cell D8"]
[null,null,"• Cooling",{"$f":"'5.2, 5.4 - COOLING'!N41","v":0},{"$f":"'5.2, 5.4 - COOLING'!O41","v":0},{"$f":"'5.2, 5.4 - COOLING'!P41","v":0},null,"See instructions in cell D8"]
[null,"(n) Duct Distribution Design","For in-unit forced air distribution systems, perform design calculations (using ACCA Manuals J and D, the ASHRAE Handbook of Fundamentals, or an equivalent procedure) and install ducts accordingly. ","-","-","-","-"]
[null,null,"• Heating",{"$f":"'5.1, 5.3 - HEATING'!M67","v":0},{"$f":"'5.1, 5.3 - HEATING'!N67","v":0},{"$f":"'5.1, 5.3 - HEATING'!O67","v":0},null,"See instructions in cell D8"]
[null,null,"• Cooling",{"$f":"'5.2, 5.4 - COOLING'!N47","v":0},{"$f":"'5.2, 5.4 - COOLING'!O47","v":0},{"$f":"'5.2, 5.4 - COOLING'!P47","v":0},null,"See instructions in cell D8"]
[null,null,"Bedroom must be pressure-balanced using any combination of transfer grills, jump ducts, dedicated return ducts, and/or undercut doors.","-","-","-","-"]
[null,null,"• Heating",{"$f":"'5.1, 5.3 - HEATING'!M68","v":0},{"$f":"'5.1, 5.3 - HEATING'!N68","v":0},{"$f":"'5.1, 5.3 - HEATING'!O68","v":0},null,"See instructions in cell D8"]
[null,null,"• Cooling",{"$f":"'5.2, 5.4 - COOLING'!N48","v":0},{"$f":"'5.2, 5.4 - COOLING'!O48","v":0},{"$f":"'5.2, 5.4 - COOLING'!P48","v":0},null,"See instructions in cell D8"]
[null,"6.  Lighting"]
[null,"(a) Occupancy Controls","All non-apartment spaces, except those intended for 24-hour operation or where automatic shutoff would endanger the safety of occupants, must have occupancy sensors or automatic bi-level lighting controls.",{"$f":"'6.1, 6.2, 6.3 - LIGHTING'!K97","v":0},{"$f":"'6.1, 6.2, 6.3 - LIGHTING'!L97","v":0},{"$f":"'6.1, 6.2, 6.3 - LIGHTING'!M97","v":0},null,"See instructions in cell D8"]
[null,"(b) Common Area Lighting",{"$f":"IF('Project Info'!$C$12=\"\",\"<Confirm if project is participating in NYSERDA MPP on Project Info tab>\",IF('Project Info'!$C$12=\"Yes\",R100,Q100))","v":"<Confirm if project is participating in NYSERDA MPP on Project Info tab>"},{"$f":"'6.1, 6.2, 6.3 - LIGHTING'!K98","v":0},{"$f":"'6.1, 6.2, 6.3 - LIGHTING'!L98","v":0},{"$f":"'6.1, 6.2, 6.3 - LIGHTING'!M98","v":0},null,"See instructions in cell D8",null,null,null,null,null,null,null,null,"80% of installed light fixtures must be ENERGY STAR certified or have ENERGY STAR certified lamps installed. Alternatively, 100% of installed light fixtures in common spaces must have high-efficacy lamps installed, as defined in Appendix B.","All light fixtures in non-apartments spaces, including hallways, stairwells, lobbies, elevators and decorative fixtures, shall have a combined lamp and ballast efficacies meeting or exceeding ENERGY STAR specifications.  Alternatively, T-5 or T-8 lamps with electronic ballasts or ENERGY STAR certified screw-in lamps may be used."]
[null,null,"Total specified lighting power for the combined non-apartment spaces shall not exceed ASHRAE 90.1-2007 allowances for those combined spaces by more than 20%.",{"$f":"'6.1, 6.2, 6.3 - LIGHTING'!K99","v":0},{"$f":"'6.1, 6.2, 6.3 - LIGHTING'!L99","v":0},{"$f":"'6.1, 6.2, 6.3 - LIGHTING'!M99","v":0},null,"See instructions in cell D8"]
[null,"(c) Exit Signs","All exit signs shall be specified as LED (not to exceed 5W per face) or photo-luminescent and shall conform to local building code; fixtures located above stairwell doors and other forms of egress shall contain a battery back-up feature.",{"$f":"'6.1, 6.2, 6.3 - LIGHTING'!K100","v":0},{"$f":"'6.1, 6.2, 6.3 - LIGHTING'!L100","v":0},{"$f":"'6.1, 6.2, 6.3 - LIGHTING'!M100","v":0},null,"See instructions in cell D8"]
[null,"(d) Exterior Lighting","Fixtures must include automatic switching on timers or photocell controls except fixtures intended for 24-hour operation, required for security, or located on apartment balconies.",{"$f":"'6.1, 6.2, 6.3 - LIGHTING'!K101","v":0},{"$f":"'6.1, 6.2, 6.3 - LIGHTING'!L101","v":0},{"$f":"'6.1, 6.2, 6.3 - LIGHTING'!M101","v":0},null,"See instructions in cell D8"]
[null,null,{"$f":"IF('Project Info'!$C$12=\"\",\"<Confirm if project is participating in NYSERDA MPP on Project Info tab>\",IF('Project Info'!$C$12=\"Yes\",R104,Q104))","v":"<Confirm if project is participating in NYSERDA MPP on Project Info tab>"},{"$f":"'6.1, 6.2, 6.3 - LIGHTING'!K102","v":0},{"$f":"'6.1, 6.2, 6.3 - LIGHTING'!L102","v":0},{"$f":"'6.1, 6.2, 6.3 - LIGHTING'!M102","v":0},null,"See instructions in cell D8",null,null,null,null,null,null,null,null,"80% of outdoor lighting fixtures shall be ENERGY STAR certified or have ENERGY STAR certified lamps installed. Alternatively, 100% of outdoor lighting fixtures must have high-efficacy lamps installed, as defined in Appendix B. ","All outdoor lighting fixtures shall have combined lamp and ballast efficacies meeting or exceeding ENERGY STAR specifications."]
[null,"(e) In-Unit Lighting",{"$f":"IF('Project Info'!$C$12=\"\",\"<Confirm if project is participating in NYSERDA MPP on Project Info tab>\",IF('Project Info'!$C$12=\"Yes\",R105,Q105))","v":"<Confirm if project is participating in NYSERDA MPP on Project Info tab>"},{"$f":"'6.1, 6.2, 6.3 - LIGHTING'!K104","v":0},{"$f":"'6.1, 6.2, 6.3 - LIGHTING'!L104","v":0},{"$f":"'6.1, 6.2, 6.3 - LIGHTING'!M104","v":0},null,"See instructions in cell D8",null,null,null,null,null,null,null,null,"80% of in-unit light fixtures must be ENERGY STAR certified or have ENERGY STAR certified lamps installed. Alternatively, 100% of in-unit light fixtures must have high-efficacy lamps installed, as defined in Appendix B.\n \n\nWhen calculating overall lighting power density, use 1.1 W/ft2 for spaces where lighting is not installed.","All hard-wired lighting fixtures and ceiling fans installed within apartments shall meet or exceed ENERGY STAR specifications.  ENERGY STAR certified screw-in lamps may be used in  the following applications only:  Closets, storage spaces, and other locations that are not within habitable living space.\n\nWhen calculating overall lighting power density, use 0.7 W/ft2 for spaces where lighting is not installed."]
[null,"(f) Illumination Levels","At a minimum, interior lighting must be designed to meet light levels (footcandles) by space type as recommended by the Illumination Engineering Society (IESNA) Lighting Handbook, 9th edition. Values for commonly used spaces are listed in the Performance Path. For senior housing, minimum illumination requirements may follow recommendations in IESNA’s 2007 Lighting and the Visual Environment for Senior Living. See Appendix B of the Performance Path to determine lamp lumens.",{"$f":"'6.1, 6.2, 6.3 - LIGHTING'!K28","v":0},{"$f":"'6.1, 6.2, 6.3 - LIGHTING'!L28","v":0},{"$f":"'6.1, 6.2, 6.3 - LIGHTING'!M28","v":0},null,"See instructions in cell D8"]
[null,"7.  Motors"]
[null,"(a) Heating Pump Motor Efficiency","All three-phase pump motors 1 horse-power or larger shall meet or exceed efficiency standards for NEMA Premium™ motors, where available.",{"$f":"'7.1 - MOTORS'!J34","v":0},{"$f":"'7.1 - MOTORS'!K34","v":0},{"$f":"'7.1 - MOTORS'!L34","v":0},null,"See instructions in cell D8"]
[null,"(b) Cooling Pump Motor Efficiency","All three-phase pump motors 1 horse-power or larger shall meet or exceed efficiency standards for NEMA Premium™ motors, where available.",{"$f":"'7.1 - MOTORS'!J35","v":0},{"$f":"'7.1 - MOTORS'!K35","v":0},{"$f":"'7.1 - MOTORS'!L35","v":0},null,"See instructions in cell D8"]
[null,"(c) DHW Pump Motor Efficiency","All three-phase pump motors 1 horse-power or larger shall meet or exceed efficiency standards for NEMA Premium™ motors, where available.",{"$f":"'7.1 - MOTORS'!J36","v":0},{"$f":"'7.1 - MOTORS'!K36","v":0},{"$f":"'7.1 - MOTORS'!L36","v":0},null,"See instructions in cell D8"]
[null,"8.  Ventilation & Infiltration"]
[null,"(a) Building Air Barrier","The building plans shall demonstrate a continuous, unbroken air barrier separating the conditioned space of the building from the exterior, unconditioned spaces within the building, commercial spaces, mechanical rooms vented with unconditioned air, mechanical chases opening to unconditioned spaces, elevator shafts, and garages or other vehicle/equipment storage facilities.",{"$f":"'8.1 - INF_EXT AIR BARRIER'!G47","v":0},{"$f":"'8.1 - INF_EXT AIR BARRIER'!H47","v":0},{"$f":"'8.1 - INF_EXT AIR BARRIER'!I47","v":0},null,"See instructions in cell D8"]
[null,"(b) Apartment Infiltration","Apartments shall be sealed to reduce air exchange between the apartment and outside as well as the apartment and other adjacent spaces.  A maximum air leakage rate of 0.30 CFM50 per square feet of enclosure is allowed.",{"$f":"'8.1 - INF_BLOWER DOOR TEST'!I33","v":0},{"$f":"'8.1 - INF_BLOWER DOOR TEST'!J33","v":0},{"$f":"'8.1 - INF_BLOWER DOOR TEST'!K33","v":0},null,"See instructions in cell D8"]
[null,"(c) Non-Apartment Ventilation","Common area ventilation systems shall be designed and tested to satisfy minimum requirements of ASHRAE 62.1-2007.",{"$f":"'8.2 - VENT_SCHEDULE&TAB REPORT'!O55","v":0},{"$f":"'8.2 - VENT_SCHEDULE&TAB REPORT'!P55","v":0},{"$f":"'8.2 - VENT_SCHEDULE&TAB REPORT'!Q55","v":0},null,"See instructions in cell D8"]
[null,"(d) In-Unit Ventilation",{"$f":"IF('Project Info'!$C$12=\"\",\"<Confirm if project is participating in NYSERDA MPP on Project Info tab>\",IF('Project Info'!$C$12=\"Yes\",R115,Q115))","v":"<Confirm if project is participating in NYSERDA MPP on Project Info tab>"},{"$f":"'8.2 - VENT_SCHEDULE&TAB REPORT'!O56","v":0},{"$f":"'8.2 - VENT_SCHEDULE&TAB REPORT'!P56","v":0},{"$f":"'8.2 - VENT_SCHEDULE&TAB REPORT'!Q56","v":0},null,"See instructions in cell D8",null,null,null,null,null,null,null,null,"Apartment ventilation and local exhaust systems shall be designed and tested to satisfy minimum requirements of ASHRAE 62.2-2007, without reliance on natural ventilation.","Apartment ventilation and local exhaust systems shall be designed and tested to satisfy minimum requirements of ASHRAE 62.2-2007, without reliance on natural ventilation.\n\nOutdoor air must be provided to each unit directly from the outdoors.  Projects using exhaust ventilation systems must specify how outside air is delivered at the flow rate required by ASHRAE 62.2-2007.  Systems that rely on transfer air from pressurized hallways or corridors, adjacent to dwelling units, attics, etc., are prohibited."]
[null,null,"Apartment in-line and ceiling exhaust fans must be ENERGY STAR certified.",{"$f":"'8.2 - VENT_SCHEDULE&TAB REPORT'!O54","v":0},{"$f":"'8.2 - VENT_SCHEDULE&TAB REPORT'!P54","v":0},{"$f":"'8.2 - VENT_SCHEDULE&TAB REPORT'!Q54","v":0},null,"See instructions in cell D8"]
[null,"(e) Duct sealing at joints and connections","Ventilation system ductwork shall be sealed at all transverse joints and connections including boot to wall/ceiling connections through drywall using UL-181 compliant materials and methods. Central exhaust systems that serve one or more apartments must be tested for duct leakage, which cannot exceed 10 CFM50 per register per shaft.",{"$f":"'8.2 - VENT_DUCT TIGHTNESS'!G32","v":0},{"$f":"'8.2 - VENT_DUCT TIGHTNESS'!H32","v":0},{"$f":"'8.2 - VENT_DUCT TIGHTNESS'!I32","v":0},null,"See instructions in cell D8"]
[null,null,"Ductwork penetrating the building envelope shall be sealed to prevent air leakage through the duct system and/or the building envelope. This includes but is not limited to roof curbs and exterior wall exhaust/intake vents.",{"$f":"'8.2 - VENT_DUCT TIGHTNESS'!G33","v":0},{"$f":"'8.2 - VENT_DUCT TIGHTNESS'!H33","v":0},{"$f":"'8.2 - VENT_DUCT TIGHTNESS'!I33","v":0},null,"See instructions in cell D8"]
[null,"9.  Metering"]
[null,"(a) Nonresidential Associated Spaces","Post-construction, the utility consumption of the residential-associated spaces must be capable of evaluation independent of any commercial/retail spaces. These nonresidential associated parts of the building shall be separately metered (or sub-metered) for electricity, gas, fuel oil, water, steam, and hot water for domestic and/or space heating purposes.",{"$f":"'9.1 - METERS'!J29","v":0},{"$f":"'9.1 - METERS'!K29","v":0},{"$f":"'9.1 - METERS'!L29","v":0},null,"See instructions in cell D8"]
[null,"(b) Direct-Metered Utilities","For buildings that are direct-metered for utilities to the apartments, the building owner must secure signed releases from individual apartment occupants to allow for benchmarking or find alternative methods to assessing whole building energy consumption,","N/A","N/A",{"$f":"'9.1 - METERS'!L32","v":0},null,"See instructions in cell D8"]
[null,"[1] Many motors are NEMA labeled and this label alone does not ensure that a motor is energy-efficient.  This requirement refers specifically to the NEMA Premium energy efficient motors program.  Participating companies may be found at:"]
[null,"http://www.nema.org/Policy/Energy/Efficiency/Documents/NEMA_Premium_Partners.pdf"]

{"sheet":"Prescriptive Path Checklist","index":6,"n_rows":133,"n_cols":18,"rows_kept":133,"cut":false,"hidden":true,"merged":[[131,6,132,6],[121,1,124,1],[65,1,67,1],[89,1,94,1],[131,1,131,5],[71,1,79,1],[82,1,85,1],[86,1,88,1],[106,1,108,1],[118,1,120,1],[95,1,100,1],[125,1,126,1],[115,1,115,2],[103,1,104,1],[63,1,64,1],[68,1,70,1],[101,1,101,2],[128,1,128,2],[11,1,16,1],[25,1,25,2],[61,1,62,1],[47,1,48,1],[55,1,55,2],[26,1,46,1],[56,1,58,1],[1,1,1,5],[2,1,2,5],[7,3,7,4],[19,1,20,1],[17,1,17,2],[10,1,10,2]]}
[null,"Instructions"]
[null,"1) For Prescriptive Path projects, this Worksheet confirms all requirements of the Prescriptive Path have been met or exceeded."]
[null,"2) Complete all T&V Worksheets and this checklist will be automatically updated."]
[null,"3) Review the checklist and add clarificaiton in the Comments column for any items that have not been verified or are not applicable."]
[null,"4) Submit to EPA twice, once after all Prescriptive Path requirements have been verified in design and again after the final inspection."]
[]
[]
[null,{"$f":"'Project Info'!C3&\" Prescriptive Path Checklist\"","v":" Prescriptive Path Checklist"},null,"<Select One - Plan Review or Final Inspection>"]
[]
[null,"Component","Prescriptive Path\nThe proposed design shall AT LEAST meet each of these requirements for each indicated measure or system, or applicable Local, State, or National codes, whichever is more stringent.","Location in Specs/ DWGs","Verified in Plan Review","Verified by Inspector","Explanation for N/A or Non-Verified Requirements",null,null,null,null,null,null,null,null,null,"EPA Multifamily Highrise Program - Unique Prescriptive Path Requirements","NYSERDA Multifamily Performance Program - Unique Prescriptive Path Requirements"]
[null,"1.  Appliances"]
[null,"(a)  Appliances","When provided in common areas and/or apartments, refrigerators, dishwashers, clothes washers, ceiling fans and vending machines must be ENERGY STAR certified.","-","-","-","-"]
[null,null,{"$f":"'1.1 - APPLIANCES'!D26","v":"Refrigerators"},{"$f":"'1.1 - APPLIANCES'!M26","v":0},{"$f":"'1.1 - APPLIANCES'!N26","v":0},{"$f":"'1.1 - APPLIANCES'!O26","v":0},null,{"$f":"IF($D$8=\"<Select One - Plan Review or Final Inspection>\",\"See instructions in cell D8\",IF($D$8=\"Plan Review\",(IF(E13=\"No\",IF(G13=\"\",\"Provide explanation for Non-Verified Requirements\",\"\"),IF(E13=\"NA\",IF(G13=\"\",\"Provide explanation for this NA item\",\"\"),IF(E13=0,IF(G13=\"\",\"Provide information in corresponding worksheet. Identify as Y, N or NA.\"),\"\")))),IF($D$8=\"Final Inspection\",(IF(F13=\"No\",IF(G13=\"\",\"Provide explanation for Non-Verified Requirements\",\"\"),IF(F13=\"NA\",IF(G13=\"\",\"Provide explanation for this NA item\",\"\"),IF(F13=0,IF(G13=\"\",\"Provide information in corresponding worksheet. Identify as Y, N or NA.\", \"\"),\"\")))))))","v":"See instructions in cell D8"}]
[null,null,{"$f":"'1.1 - APPLIANCES'!D27","v":"Dishwashers"},{"$f":"'1.1 - APPLIANCES'!M27","v":0},{"$f":"'1.1 - APPLIANCES'!N27","v":0},{"$f":"'1.1 - APPLIANCES'!O27","v":0},null,{"$f":"IF($D$8=\"<Select One - Plan Review or Final Inspection>\",\"See instructions in cell D8\",IF($D$8=\"Plan Review\",(IF(E14=\"No\",IF(G14=\"\",\"Provide explanation for Non-Verified Requirements\",\"\"),IF(E14=\"NA\",IF(G14=\"\",\"Provide explanation for this NA item\",\"\"),IF(E14=0,IF(G14=\"\",\"Provide information in corresponding worksheet. Identify as Y, N or NA.\"),\"\")))),IF($D$8=\"Final Inspection\",(IF(F14=\"No\",IF(G14=\"\",\"Provide explanation for Non-Verified Requirements\",\"\"),IF(F14=\"NA\",IF(G14=\"\",\"Provide explanation for this NA item\",\"\"),IF(F14=0,IF(G14=\"\",\"Provide information in corresponding worksheet. Identify as Y, N or NA.\", \"\"),\"\")))))))","v":"See instructions in cell D8"}]
[null,null,{"$f":"'1.1 - APPLIANCES'!D28","v":"Clothes Washers"},{"$f":"'1.1 - APPLIANCES'!M28","v":0},{"$f":"'1.1 - APPLIANCES'!N28","v":0},{"$f":"'1.1 - APPLIANCES'!O28","v":0},null,"See instructions in cell D8"]
[null,null,{"$f":"'1.1 - APPLIANCES'!D29","v":"Ceiling fans"},{"$f":"'1.1 - APPLIANCES'!M29","v":0},{"$f":"'1.1 - APPLIANCES'!N29","v":0},{"$f":"'1.1 - APPLIANCES'!O29","v":0},null,"See instructions in cell D8"]
[null,null,{"$f":"'1.1 - APPLIANCES'!D30","v":"Vending Machines"},{"$f":"'1.1 - APPLIANCES'!M30","v":0},{"$f":"'1.1 - APPLIANCES'!N30","v":0},{"$f":"'1.1 - APPLIANCES'!O30","v":0},null,"See instructions in cell D8"]
[null,"2.  Domestic Water Heating"]
[null,"(a) General","Domestic water heating systems must comply with ASHRAE 90.1-2007 Sections 7.4 and 7.5.",{"$f":"'2.1-2.2 - DOMESTIC HOT WATER'!M46","v":0},{"$f":"'2.1-2.2 - DOMESTIC HOT WATER'!N46","v":0},{"$f":"'2.1-2.2 - DOMESTIC HOT WATER'!O46","v":0},null,"See instructions in cell D8"]
[null,"(b) Water Heating Type and Efficiency","Domestic water heating equipment shall be ENERGY STAR certified, where applicable, and meet minimum efficiencies below. ENERGY STAR certification must be verified through the ENERGY STAR website. Atmospherically vented gas water heaters, tankless coils and side-arm water heaters shall not be specified. Indirect water heaters, with or without storage, are acceptable.\n\nWater Heater Minimum Efficiencies\n      •  In-Unit Electric OR Gas Water Heaters (storage or instantaneous)\n         - Gas (EF): 0.69-(0.002 x Tank Gallon Capacity)\n         - Electric (EF): 0.97-(0.001 x Tank Gallon Capacity)\n      •  Hot Water Supply Boiler (Oil or Gas): 85% Et",{"$f":"'2.1-2.2 - DOMESTIC HOT WATER'!M48","v":0},{"$f":"'2.1-2.2 - DOMESTIC HOT WATER'!N48","v":0},{"$f":"'2.1-2.2 - DOMESTIC HOT WATER'!O48","v":0},null,"See instructions in cell D8"]
[null,null,"If storage is provided, the maximum storage tank capacity shall be specified based on occupancy.",{"$f":"'2.1-2.2 - DOMESTIC HOT WATER'!M49","v":0},{"$f":"'2.1-2.2 - DOMESTIC HOT WATER'!N49","v":0},{"$f":"'2.1-2.2 - DOMESTIC HOT WATER'!O49","v":0},null,"See instructions in cell D8"]
[null,"(c) Water Heating Temperature","The temperature setting of in-unit storage water heaters must not exceed 140°F. For both in-unit and central DHW systems, temperatures measured at faucets and showerheads must not exceed 125°F.",{"$f":"'2.1-2.2 - DOMESTIC HOT WATER'!M54","v":0},{"$f":"'2.1-2.2 - DOMESTIC HOT WATER'!N54","v":0},{"$f":"'2.1-2.2 - DOMESTIC HOT WATER'!O54","v":0},null,"See instructions in cell D8"]
[null,"(d) Water Heating Controls","When mixing valves are specified to control hot water temperature for central domestic water heating systems serving apartments, electronic mixing valves shall be used.",{"$f":"'2.1-2.2 - DOMESTIC HOT WATER'!M55","v":0},{"$f":"'2.1-2.2 - DOMESTIC HOT WATER'!N55","v":0},{"$f":"'2.1-2.2 - DOMESTIC HOT WATER'!O55","v":0},null,"See instructions in cell D8"]
[null,"(e) Water Heating Pipe Insulation","Piping carrying liquid with temperatures greater than 105°F must have a minimum of 1” of insulation. Pipes 1.5” in diameter and greater must have a minimum of 1.5” of insulation. Extent and location to be determined by ASHRAE 90.1-2007 Section 7.4.3 or local code.",{"$f":"'2.1-2.2 - DOMESTIC HOT WATER'!M53","v":0},{"$f":"'2.1-2.2 - DOMESTIC HOT WATER'!N53","v":0},{"$f":"'2.1-2.2 - DOMESTIC HOT WATER'!O53","v":0},null,"See instructions in cell D8"]
[null,"(f) Plumbing Fixtures","• The average flow rate for all showers must be ≤ 1.75 gallons per minute per stall (as rated at 80 psi) and all showerheads must be WaterSense labeled. \n• If flow ratings at 80 psi are not available, WaterSense labeled faucets or aerators may be used to meet this prerequisite. \n• All lavatory faucets or aerators must be WaterSense labeled. \n• The average flow rate for all other faucets must be ≤ 2.0 gallons per minute (as rated at 80 psi). \n• All tank-type toilets must be WaterSense labeled.\n",{"$f":"'2.1-2.2 - DOMESTIC HOT WATER'!M50","v":0},{"$f":"'2.1-2.2 - DOMESTIC HOT WATER'!N50","v":0},{"$f":"'2.1-2.2 - DOMESTIC HOT WATER'!O50","v":0},null,"See instructions in cell D8"]
[null,"3.  Envelope"]
[null,"(a) General","Assembly U-value determinations must follow ASHRAE 90.1-2007, Appendix A.\n\nSee Tables 2 and 3 for climate specific envelope requirements for the following components: roof insulation; above grade and below grade wall insulation; floor and slab insulation; exterior doors; and vertical glazing.","-","-","-","-"]
[null,null,"• Below Grade Walls",{"$f":"'3.1 - ENV_BELOW GRADE WALLS'!$G$45","v":0},{"$f":"'3.1 - ENV_BELOW GRADE WALLS'!$H$45","v":0},{"$f":"'3.1 - ENV_BELOW GRADE WALLS'!$I$45","v":0},null,"See instructions in cell D8"]
[null,null,"• Above Grade Walls",{"$f":"'3.1 - ENV_ABOVE GRADE WALLS'!$G$61","v":0},{"$f":"'3.1 - ENV_ABOVE GRADE WALLS'!$H$61","v":0},{"$f":"'3.1 - ENV_ABOVE GRADE WALLS'!$I$61","v":0},null,"See instructions in cell D8"]
[null,null,"• Floor Perimeter/ Plank Edges",{"$f":"'3.1 - ENV_ABOVE GRADE WALLS'!$G$63","v":0},{"$f":"'3.1 - ENV_ABOVE GRADE WALLS'!$H$63","v":0},{"$f":"'3.1 - ENV_ABOVE GRADE WALLS'!$I$63","v":0},null,"See instructions in cell D8"]
[null,null,"• Roof",{"$f":"'3.2 - ENV_ROOF'!$G$46","v":0},{"$f":"'3.2 - ENV_ROOF'!$H$46","v":0},{"$f":"'3.2 - ENV_ROOF'!$I$46","v":0},null,"See instructions in cell D8"]
[null,null,"• Floors Over Unconditioned Spaces",{"$f":"'3.3 - ENV_FLOORS'!G34","v":0},{"$f":"'3.3 - ENV_FLOORS'!$H$34","v":0},{"$f":"'3.3 - ENV_FLOORS'!$I$34","v":0},null,"See instructions in cell D8"]
[null,null,"• Below Grade Slab Floors",{"$f":"'3.3 - ENV_FLOORS'!$G$44","v":0},{"$f":"'3.3 - ENV_FLOORS'!$H$44","v":0},{"$f":"'3.3 - ENV_FLOORS'!$I$44","v":0},null,"See instructions in cell D8"]
[null,null,"• Slab-On-Grade Floors (unheated Only)",{"$f":"'3.3 - ENV_FLOORS'!$G$54","v":0},{"$f":"'3.3 - ENV_FLOORS'!$H$54","v":0},{"$f":"'3.3 - ENV_FLOORS'!$I$54","v":0},null,"See instructions in cell D8"]
[null,null,"• Slab-On-Grade Floors (embedded heated Only)",{"$f":"'3.3 - ENV_FLOORS'!$G$64","v":0},{"$f":"'3.3 - ENV_FLOORS'!$H$64","v":0},{"$f":"'3.3 - ENV_FLOORS'!$I$64","v":0},null,"See instructions in cell D8"]
[null,null,"• Exterior Doors",{"$f":"'3.5 - ENV_EXTERIOR DOORS'!J37","v":0},{"$f":"'3.5 - ENV_EXTERIOR DOORS'!K37","v":0},{"$f":"'3.5 - ENV_EXTERIOR DOORS'!L37","v":0},null,"See instructions in cell D8"]
[null,null,"The envelope components must comply with ASHRAE 90.1-2007 Sections 5.4.\n\nAll roof, wall, floor and slab insulation shall achieve RESNET-defined Grade I installation or, alternatively, Grade II for surfaces that contain a layer of continuous, air impermeable insulation (≥R-3 in CZ1-4 and ≥R-5 in CZ 5-8).","-","-","-","-"]
[null,null,"• Below Grade Walls",{"$f":"'3.1 - ENV_BELOW GRADE WALLS'!$G$50","v":0},{"$f":"'3.1 - ENV_BELOW GRADE WALLS'!$H$50","v":0},{"$f":"'3.1 - ENV_BELOW GRADE WALLS'!$I$50","v":0},null,"See instructions in cell D8"]
[null,null,"• Above Grade Walls",{"$f":"'3.1 - ENV_ABOVE GRADE WALLS'!$G$66","v":0},{"$f":"'3.1 - ENV_ABOVE GRADE WALLS'!$H$66","v":0},{"$f":"'3.1 - ENV_ABOVE GRADE WALLS'!$I$65","v":0},null,"See instructions in cell D8"]
[null,null,"• Floor Perimeter/ Plank Edges",{"$f":"'3.1 - ENV_ABOVE GRADE WALLS'!$G$67","v":0},{"$f":"'3.1 - ENV_ABOVE GRADE WALLS'!$H$67","v":0},{"$f":"'3.1 - ENV_ABOVE GRADE WALLS'!$I$67","v":0},null,"See instructions in cell D8"]
[null,null,"• Roof",{"$f":"'3.2 - ENV_ROOF'!$G$49","v":0},{"$f":"'3.2 - ENV_ROOF'!$H$49","v":0},{"$f":"'3.2 - ENV_ROOF'!$I$49","v":0},null,"See instructions in cell D8"]
[null,null,"• Floors Over Unconditioned Spaces",{"$f":"'3.3 - ENV_FLOORS'!$G$68","v":0},{"$f":"'3.3 - ENV_FLOORS'!$H$68","v":0},{"$f":"'3.3 - ENV_FLOORS'!$I$68","v":0},null,"See instructions in cell D8"]
[null,null,"• Below Grade Slab Floors",{"$f":"'3.3 - ENV_FLOORS'!$G$69","v":0},{"$f":"'3.3 - ENV_FLOORS'!$H$69","v":0},{"$f":"'3.3 - ENV_FLOORS'!$I$69","v":0},null,"See instructions in cell D8"]
[null,null,"• Slab-On-Grade Floors (unheated Only)",{"$f":"'3.3 - ENV_FLOORS'!$G$70","v":0},{"$f":"'3.3 - ENV_FLOORS'!$H$70","v":0},{"$f":"'3.3 - ENV_FLOORS'!$I$70","v":0},null,"See instructions in cell D8"]
[null,null,"• Slab-On-Grade Floors (embedded heated Only)",{"$f":"'3.3 - ENV_FLOORS'!$G$71","v":0},{"$f":"'3.3 - ENV_FLOORS'!$H$71","v":0},{"$f":"'3.3 - ENV_FLOORS'!$I$71","v":0},null,"See instructions in cell D8"]
[null,null,"• Exterior Doors",{"$f":"'3.5 - ENV_EXTERIOR DOORS'!J37","v":0},{"$f":"'3.5 - ENV_EXTERIOR DOORS'!K37","v":0},{"$f":"'3.5 - ENV_EXTERIOR DOORS'!L37","v":0},null,"See instructions in cell D8"]
[null,null,"For steel-framed and metal building walls, continuous exterior insulation (≥R-3) is required on above grade walls. For mass or masonry walls with metal framing, continuous interior or exterior insulation (≥R-3) is required on above grade walls. \n\nProjected balconies are currently exempt, however, EPA recommends that they are thermally broken.",{"$f":"'3.1 - ENV_ABOVE GRADE WALLS'!G68","v":0},{"$f":"'3.1 - ENV_ABOVE GRADE WALLS'!H68","v":0},{"$f":"'3.1 - ENV_ABOVE GRADE WALLS'!I68","v":0},null,"See instructions in cell D8"]
[null,"(b) Vertical Glazing",{"$f":"IF('Project Info'!$C$12=\"\",\"<Confirm if project is participating in NYSERDA MPP on Project Info tab>\",IF('Project Info'!$C$12=\"Yes\",'Prescriptive Path Checklist'!R48,'Prescriptive Path Checklist'!Q48))","v":"<Confirm if project is participating in NYSERDA MPP on Project Info tab>"},{"$f":"'3.4 - ENV_WINDOWS'!M39","v":0},{"$f":"'3.4 - ENV_WINDOWS'!N39","v":0},{"$f":"'3.4 - ENV_WINDOWS'!O39","v":0},null,"See instructions in cell D8",null,null,null,null,null,null,null,null,"Specified windows must be double or triple-pane, with low-emissivity glass or coatings. \n\nIf an NFRC label is not available, manufacturer must provide assembly U-values, not center-of-glass. Alternatively, LBNL’s WINDOW 6.3 software or NFRC’s CMAST may be used.\n\nBased on the climate zone, the specified windows meet the Prescriptive requirements.","Specified windows must be double or triple-pane, with low-emissivity glass or coatings. \n\nBased on the climate zone, the specified windows meet the Prescriptive requirements.\n\nWindow frames must be separated from conductive framing (metal & masonry studs, lintels & sills) with insulation designed to serve as a thermal break."]
[null,null,"Maximum allowable glazing area: 30% Window-to-Wall Ratio",{"$f":"'3.4 - ENV_WINDOWS'!M40","v":0},{"$f":"'3.4 - ENV_WINDOWS'!N40","v":0},{"$f":"'3.4 - ENV_WINDOWS'!O40","v":0},null,"See instructions in cell D8"]
[null,"(c) Vestibules","When required by local building code, entranceways shall be designed with vestibules with weather-stripping hard-fastened to the door or frame.",{"$f":"'3.5 - ENV_EXTERIOR DOORS'!J37","v":0},{"$f":"'3.5 - ENV_EXTERIOR DOORS'!K37","v":0},{"$f":"'3.5 - ENV_EXTERIOR DOORS'!L37","v":0},null,"See instructions in cell D8"]
[null,"(d) AC Sleeves","If installing sleeves for through-wall AC units, insulated covers must be provided by the building for use during heating season and when AC units are not installed.",{"$f":"'5.2, 5.4 - COOLING'!N57","v":0},{"$f":"'5.2, 5.4 - COOLING'!O57","v":0},{"$f":"'5.2, 5.4 - COOLING'!P57","v":0},null,"See instructions in cell D8"]
[null,"4. Garages and Sidewalks"]
[null,"(a) Air Infiltration","Attached garages shall be fully compartmentalized from the rest of the building through air sealing.  All pipe and conduit penetrations shall be sealed with material compatible with the surface and resilient to temperature fluctuations.",{"$f":"'4.1 - GARAGES_CMPTZ & HEATING '!G25","v":0},{"$f":"'4.1 - GARAGES_CMPTZ & HEATING '!H25","v":0},{"$f":"'4.1 - GARAGES_CMPTZ & HEATING '!I25","v":0},null,"See instructions in cell D8"]
[null,"(b) Pipe Freeze Protection","Garages, including plenums and dropped ceilings within the garage, shall not be heated for comfort or to prevent pipes from freezing.  Piping design and layout shall locate piping within conditioned spaces or grouped and properly insulated to prevent freezing. Heat tracing for freeze protection may not be used.",{"$f":"'4.1 - GARAGES_CMPTZ & HEATING '!G23","v":0},{"$f":"'4.1 - GARAGES_CMPTZ & HEATING '!H23","v":0},{"$f":"'4.1 - GARAGES_CMPTZ & HEATING '!I23","v":0},null,"See instructions in cell D8"]
[null,"(c) Ice Prevention","Radiant heating, either wall or ceiling-mounted or within the garage floor (or sidewalks) may be used to prevent ice formation on the ground as a safety feature only and temperature-based controls  must comply with ASHRAE 90.1-2007 Section 6.4.3.8.",{"$f":"'4.1 - GARAGES_CMPTZ & HEATING '!G24","v":0},{"$f":"'4.1 - GARAGES_CMPTZ & HEATING '!H24","v":0},{"$f":"'4.1 - GARAGES_CMPTZ & HEATING '!I24","v":0},null,"See instructions in cell D8"]
[null,"5. Heating and Cooling"]
[null,"(a) General","The heating and cooling systems must comply with ASHRAE 90.1-2007 Sections 6.4 and 6.5.","-","-","-","-"]
[null,null,"• Heating",{"$f":"'5.1, 5.3 - HEATING'!M44","v":0},{"$f":"'5.1, 5.3 - HEATING'!N44","v":0},{"$f":"'5.1, 5.3 - HEATING'!O44","v":0},null,"See instructions in cell D8"]
[null,null,"• Cooling",{"$f":"'5.2, 5.4 - COOLING'!N33","v":0},{"$f":"'5.2, 5.4 - COOLING'!O33","v":0},{"$f":"'5.2, 5.4 - COOLING'!P33","v":0},null,"See instructions in cell D8"]
[null,"(b) Heating System Type",{"$f":"IF('Project Info'!$C$12=\"\",\"<Confirm if project is participating in NYSERDA MPP on Project Info tab>\",IF('Project Info'!$C$12=\"Yes\",'Prescriptive Path Checklist'!R60,'Prescriptive Path Checklist'!Q60))","v":"<Confirm if project is participating in NYSERDA MPP on Project Info tab>"},{"$f":"'5.1, 5.3 - HEATING'!M46","v":0},{"$f":"'5.1, 5.3 - HEATING'!N46","v":0},{"$f":"'5.1, 5.3 - HEATING'!O46","v":0},null,"See instructions in cell D8",null,null,null,null,null,null,null,null,"Atmospherically vented gas furnaces and boilers shall not be specified.","Heating equipment shall be ENERGY STAR certified, where applicable. Atmospherically vented gas furnaces and boilers shall not be specified. "]
[null,"(c) Electric Resistance Heating","Electric resistance space heating not permitted in any space.\n\nIn Climates Zones 1 through 6, if the prescriptive Heating Season Performance Factors are met for air-source heat pumps, electric resistance back-up heating is allowed, if programmable thermostats with adaptive recovery technology are installed.",{"$f":"'5.1, 5.3 - HEATING'!M47","v":0},{"$f":"'5.1, 5.3 - HEATING'!N47","v":0},{"$f":"'5.1, 5.3 - HEATING'!O47","v":0},null,"See instructions in cell D8"]
[null,"(d) Heating System Sizing and Efficiency","Load sizing calculations must reflect the design; installed capacity cannot exceed design by more than 20%, except when smaller sizes are not available.\n\nHeating loads shall be calculated, equipment capacity shall be selected, and duct systems shall be sized according to the latest editions of ACCA Manual J, S, & D, respectively, ASHRAE 2009 Handbook of Fundamentals, or a substantively equivalent procedure. Indoor temperatures shall be 70°F for heating, outdoor temperatures shall be the 99.0% design temperature, as published by the ASHRAE Handbook of Fundamentals.",{"$f":"'5.1, 5.3 - HEATING'!M48","v":0},{"$f":"'5.1, 5.3 - HEATING'!N48","v":0},{"$f":"'5.1, 5.3 - HEATING'!O48","v":0},null,"See instructions in cell D8"]
[null,null,"Based on the climate zone, the specified heating equipment meets the Prescriptive requirements for efficiency. If ENERGY STAR certification is required, it must be verified through the ENERGY STAR website.",{"$f":"'5.1, 5.3 - HEATING'!M46","v":0},{"$f":"'5.1, 5.3 - HEATING'!N46","v":0},{"$f":"'5.1, 5.3 - HEATING'!O46","v":0},null,"See instructions in cell D8"]
[null,"(e) Cooling System Sizing and Efficiency","Load sizing calculations must reflect the design; installed capacity cannot exceed design by more than 20%, except when smaller sizes are not available.\n\nCooling loads shall be calculated, equipment capacity shall be selected, and duct systems shall be sized according to the latest editions of ACCA Manual J, S, & D, respectively, ASHRAE 2009 Handbook of Fundamentals, or a substantively equivalent procedure. Indoor temperatures shall be 75°F for cooling, outdoor temperatures shall be the 1.0% design temperature, as published by the ASHRAE Handbook of Fundamentals.",{"$f":"'5.2, 5.4 - COOLING'!N36","v":0},{"$f":"'5.2, 5.4 - COOLING'!O36","v":0},{"$f":"'5.2, 5.4 - COOLING'!P36","v":0},null,"See instructions in cell D8"]
[null,null,{"$f":"IF('Project Info'!$C$12=\"\",\"<Confirm if project is participating in NYSERDA MPP on Project Info tab>\",IF('Project Info'!$C$12=\"Yes\",'Prescriptive Path Checklist'!R65,'Prescriptive Path Checklist'!Q65))","v":"<Confirm if project is participating in NYSERDA MPP on Project Info tab>"},{"$f":"'5.2, 5.4 - COOLING'!N35","v":0},{"$f":"'5.2, 5.4 - COOLING'!O35","v":0},{"$f":"'5.2, 5.4 - COOLING'!P35","v":0},null,"See instructions in cell D8",null,null,null,null,null,null,null,null,"Based on the climate zone, the specified cooling equipment meets the Prescriptive requirements for efficiency. If ENERGY STAR  certification is required, it must be verified through the ENERGY STAR website.","Based on the climate zone, the specified cooling equipment meets the Prescriptive requirements for efficiency.  Cooling equipment shall be ENERGY STAR certified, where applicable. ENERGY STAR certification must be verified through the ENERGY STAR website."]
[null,"(f) Control Valves","For hydronic distribution systems, all terminal heating and cooling distribution equipment must be separated from the riser or distribution loop by a control valve or terminal distribution pump, so that heated or cooled fluid is not delivered to the apartment distribution equipment when there is no call from the apartment thermostats.","-","-","-","-"]
[null,null,"• Heating",{"$f":"'5.1, 5.3 - HEATING'!M58","v":0},{"$f":"'5.1, 5.3 - HEATING'!N58","v":0},{"$f":"'5.1, 5.3 - HEATING'!O58","v":0},null,"See instructions in cell D8"]
[null,null,"• Cooling",{"$f":"'5.2, 5.4 - COOLING'!N44","v":0},{"$f":"'5.2, 5.4 - COOLING'!O44","v":0},{"$f":"'5.2, 5.4 - COOLING'!P44","v":0},null,"See instructions in cell D8"]
[null,"(f) Flexible Ducts","Heating and cooling ductwork that is specified as flex duct shall follow the Sheet Metal and Air Conditioning Contractors’ (SMACNA) installation standards for flex ducts (see Appendix A of the Prescriptive Path).","-","-","-","-"]
[null,null,"• Heating",{"$f":"'5.1, 5.3 - HEATING'!M61","v":0},{"$f":"'5.1, 5.3 - HEATING'!N61","v":0},{"$f":"'5.1, 5.3 - HEATING'!O61","v":0},null,"See instructions in cell D8"]
[null,null,"• Cooling",{"$f":"'5.2, 5.4 - COOLING'!N52","v":0},{"$f":"'5.2, 5.4 - COOLING'!O52","v":0},{"$f":"'5.2, 5.4 - COOLING'!P52","v":0},null,"See instructions in cell D8"]
[null,"(h) Duct Sealing and Insulation","Heating and cooling ductwork shall be sealed at all transverse joints and connections, including ductwork connections through drywall or other finish materials, using UL‐181 compliant methods and materials. Construction documents shall specify that ductwork must be inspected before access is covered up.","-","-","-","-"]
[null,null,"• Heating",{"$f":"'5.1, 5.3 - HEATING'!M63","v":0},{"$f":"'5.1, 5.3 - HEATING'!N63","v":0},{"$f":"'5.1, 5.3 - HEATING'!O63","v":0},null,"See instructions in cell D8"]
[null,null,"• Cooling",{"$f":"'5.2, 5.4 - COOLING'!N51","v":0},{"$f":"'5.2, 5.4 - COOLING'!O51","v":0},{"$f":"'5.2, 5.4 - COOLING'!P51","v":0},null,"See instructions in cell D8"]
[null,null,"Total duct leakage for in-unit systems shall be ≤8 CFM25 per 100 ft2 of conditioned floor area. Sampling procedures and tolerances are described in the T&V Worksheets. As an alternative to meeting total duct leakage requirements post-construction, total duct leakage measured at rough-in, ≤4 CFM25 per 100ft2, with air handler and all ductwork installed, is accepted.","-","-","-","-"]
[null,null,"• Heating",{"$f":"'5.1, 5.3 - HEATING'!M69","v":0},{"$f":"'5.1, 5.3 - HEATING'!N69","v":0},{"$f":"'5.1, 5.3 - HEATING'!O69","v":0},null,"See instructions in cell D8"]
[null,null,"• Cooling",{"$f":"'5.2, 5.4 - COOLING'!N53","v":0},{"$f":"'5.2, 5.4 - COOLING'!O53","v":0},{"$f":"'5.2, 5.4 - COOLING'!P53","v":0},null,"See instructions in cell D8"]
[null,null,{"$f":"IF('Project Info'!$C$12=\"\",\"<Confirm if project is participating in NYSERDA MPP on Project Info tab>\",IF('Project Info'!$C$12=\"Yes\",'Prescriptive Path Checklist'!R78,'Prescriptive Path Checklist'!Q78))","v":"<Confirm if project is participating in NYSERDA MPP on Project Info tab>"},"-","-","-","-",null,null,null,null,null,null,null,null,null,"Heating and cooling supply and return ductwork shall be insulated to a minimum R-8 in unconditioned space.","Heating and cooling supply and return ductwork shall be insulated to a minimum R-4 in conditioned space and R-8 in unconditioned space or when located outside the building."]
[null,null,"• Heating",{"$f":"'5.1, 5.3 - HEATING'!M62","v":0},{"$f":"'5.1, 5.3 - HEATING'!N62","v":0},{"$f":"'5.1, 5.3 - HEATING'!O62","v":0},null,{"$f":"IF($D$8=\"<Select One - Plan Review or Final Inspection>\",\"See instructions in cell D8\",IF($D$8=\"Plan Review\",(IF(E79=\"No\",IF(G79=\"\",\"Provide explanation for Non-Verified Requirements\",\"\"),IF(E79=\"NA\",IF(G79=\"\",\"Provide explanation for this NA item\",\"\"),IF(E79=0,IF(G79=\"\",\"Provide information in corresponding worksheet. Identify as Y, N or NA.\"),\"\")))),IF($D$8=\"Final Inspection\",(IF(F79=\"No\",IF(G79=\"\",\"Provide explanation for Non-Verified Requirements\",\"\"),IF(F79=\"NA\",IF(G79=\"\",\"Provide explanation for this NA item\",\"\"),IF(F79=0,IF(G79=\"\",\"Provide information in corresponding worksheet. Identify as Y, N or NA.\", \"\"),\"\")))))))","v":"See instructions in cell D8"}]
[null,null,"• Cooling",{"$f":"'5.2, 5.4 - COOLING'!N49","v":0},{"$f":"'5.2, 5.4 - COOLING'!O49","v":0},{"$f":"'5.2, 5.4 - COOLING'!P49","v":0},null,"See instructions in cell D8"]
[null,"(i) Cooling Piping Insulation (Chilled water, brine and refrigerant piping)",{"$f":"IF('Project Info'!$C$12=\"\",\"<Confirm if project is participating in NYSERDA MPP on Project Info tab>\",IF('Project Info'!$C$12=\"Yes\",'Prescriptive Path Checklist'!R81,'Prescriptive Path Checklist'!Q81))","v":"<Confirm if project is participating in NYSERDA MPP on Project Info tab>"},{"$f":"'5.2, 5.4 - COOLING'!N43","v":0},{"$f":"'5.2, 5.4 - COOLING'!O43","v":0},{"$f":"'5.2, 5.4 - COOLING'!P43","v":0},null,"See instructions in cell D8",null,null,null,null,null,null,null,null,"Piping carrying fluid with temperatures less than 60°F must have a minimum of 0.5” of insulation. Pipes 1.5” in diameter and greater must have a minimum of 1.0” of insulation.  Construction documents must account for piping total thickness including required insulation when passing through planks or any other penetrations. For cooling systems that require branch pipe insulation, the insulation thickness must be considered when designing room dimensions and access chases. Construction documents shall specify that the piping must be inspected before access is covered up. Extent and location to be determined by ASHRAE 90.1-2007 Section 6.4.4.1.3 or local code.","Piping carrying fluid with temperatures less than 60°F shall be insulated in accordance with NYS ECCC.  Construction documents must account for piping total thickness including required insulation when passing through planks or any other penetrations. For cooling systems that require branch pipe insulation, the insulation thickness must be considered when designing room dimensions and access chases. Construction documents shall specify that the piping must be inspected before access is covered up. Extent and location to be determined by ASHRAE 90.1-2007 Section 6.4.4.1.3 or local code."]
[null,"(j) Heating Piping Insulation",{"$f":"IF('Project Info'!$C$12=\"\",\"<Confirm if project is participating in NYSERDA MPP on Project Info tab>\",IF('Project Info'!$C$12=\"Yes\",'Prescriptive Path Checklist'!R82,'Prescriptive Path Checklist'!Q82))","v":"<Confirm if project is participating in NYSERDA MPP on Project Info tab>"},{"$f":"'5.1, 5.3 - HEATING'!M54","v":0},{"$f":"'5.1, 5.3 - HEATING'!N54","v":0},{"$f":"'5.1, 5.3 - HEATING'!O54","v":0},null,"See instructions in cell D8",null,null,null,null,null,null,null,null,"Piping carrying fluid or steam with temperatures greater than 105°F must have a minimum of 1” of insulation. Pipes 1.5” in diameter and greater must have a minimum of 1.5” of insulation.  Construction documents must account for piping total thickness including required insulation when passing through planks or any other penetrations. For PTACs or any other heating systems that require branch pipe insulation, the insulation thickness must be considered when designing room dimensions and access chases. Construction documents shall specify that the piping must be inspected before access is covered up. Extent and location to be determined by ASHRAE 90.1-2007 Section 6.4.4.1.3 or local code.","Heating piping carrying fluid or steam with temperatures greater than 105°F shall be insulated in accordance with NYS ECCC. Construction documents must account for piping total thickness including required insulation when passing through planks or any other penetrations. For PTACs or any other heating systems that require branch pipe insulation, the insulation thickness must be considered when designing room dimensions and access chases. Construction documents shall specify that the piping must be inspected before access is covered up. Extent and location to be determined by ASHRAE 90.1-2007 Section 6.4.4.1.3 or local code."]
[null,"(k) Outside Air Dampers","For systems designed with outdoor-air supplied to the heating, cooling, or ventilation distribution system, provide motorized dampers that will automatically shut when systems or spaces are not in use.  Continuously running ventilation would not be subject to either damper, as they are always in use.","-","-","-","-"]
[null,null,"• Heating",{"$f":"'5.1, 5.3 - HEATING'!M60","v":0},{"$f":"'5.1, 5.3 - HEATING'!N60","v":0},{"$f":"'5.1, 5.3 - HEATING'!O60","v":0},null,"See instructions in cell D8"]
[null,null,"• Cooling",{"$f":"'5.2, 5.4 - COOLING'!N50","v":0},{"$f":"'5.2, 5.4 - COOLING'!O50","v":0},{"$f":"'5.2, 5.4 - COOLING'!P50","v":0},null,"See instructions in cell D8"]
[null,null,"• Ventilation",{"$f":"'8.2 - VENT_SCHEDULE&TAB REPORT'!O66","v":0},{"$f":"'8.2 - VENT_SCHEDULE&TAB REPORT'!P66","v":0},{"$f":"'8.2 - VENT_SCHEDULE&TAB REPORT'!Q66","v":0},null,"See instructions in cell D8"]
[null,"(l) Thermostats","Terminal heating and cooling distribution equipment serving an apartment shall be controlled by a thermostat(s) within the same apartment.","-","-","-","-"]
[null,null,"• Heating",{"$f":"'5.1, 5.3 - HEATING'!M72","v":0},{"$f":"'5.1, 5.3 - HEATING'!N72","v":0},{"$f":"'5.1, 5.3 - HEATING'!O72","v":0},null,"See instructions in cell D8"]
[null,null,"• Cooling",{"$f":"'5.2, 5.4 - COOLING'!N58","v":0},{"$f":"'5.2, 5.4 - COOLING'!O58","v":0},{"$f":"'5.2, 5.4 - COOLING'!P58","v":0},null,"See instructions in cell D8"]
[null,"(m) Hydronic Distribution Design","For hydronic distribution systems without automatic balancing valves, all supply/return headers must be designed in a “reverse return” configuration (i.e. first riser supplied is the last returned, etc.) and/or sized based on a water velocity of less than 4 ft/s.  Total pressure drop of terminal unit branch piping and fittings between a supply and return riser must be significantly greater than the total pressure drop from the top to the bottom of these risers.","-","-","-","-"]
[null,null,"• Heating",{"$f":"'5.1, 5.3 - HEATING'!M55","v":0},{"$f":"'5.1, 5.3 - HEATING'!N55","v":0},{"$f":"'5.1, 5.3 - HEATING'!O55","v":0},null,"See instructions in cell D8"]
[null,null,"• Cooling",{"$f":"'5.2, 5.4 - COOLING'!N40","v":0},{"$f":"'5.2, 5.4 - COOLING'!O40","v":0},{"$f":"'5.2, 5.4 - COOLING'!P40","v":0},null,"See instructions in cell D8"]
[null,null,"Calculations and assumptions for sizing circulating pumps must meet Chapter 43 of the ASHRAE Handbook, HVAC Systems and Equipment or equivalent industry accepted standard.","-","-","-","-"]
[null,null,"• Heating",{"$f":"'5.1, 5.3 - HEATING'!M56","v":0},{"$f":"'5.1, 5.3 - HEATING'!N56","v":0},{"$f":"'5.1, 5.3 - HEATING'!O56","v":0},null,"See instructions in cell D8"]
[null,null,"• Cooling",{"$f":"'5.2, 5.4 - COOLING'!N41","v":0},{"$f":"'5.2, 5.4 - COOLING'!O41","v":0},{"$f":"'5.2, 5.4 - COOLING'!P41","v":0},null,"See instructions in cell D8"]
[null,"(n) Duct Distribution Design","For in-unit forced air distribution systems, perform design calculations (using ACCA Manuals J and D, the ASHRAE Handbook of Fundamentals, or an equivalent procedure) and install ducts accordingly. ","-","-","-","-"]
[null,null,"• Heating",{"$f":"'5.1, 5.3 - HEATING'!M67","v":0},{"$f":"'5.1, 5.3 - HEATING'!N67","v":0},{"$f":"'5.1, 5.3 - HEATING'!O67","v":0},null,"See instructions in cell D8"]
[null,null,"• Cooling",{"$f":"'5.2, 5.4 - COOLING'!N47","v":0},{"$f":"'5.2, 5.4 - COOLING'!O47","v":0},{"$f":"'5.2, 5.4 - COOLING'!P47","v":0},null,"See instructions in cell D8"]
[null,null,"Bedroom must be pressure-balanced using any combination of transfer grills, jump ducts, dedicated return ducts, and/or undercut doors.","-","-","-","-"]
[null,null,"• Heating",{"$f":"'5.1, 5.3 - HEATING'!M68","v":0},{"$f":"'5.1, 5.3 - HEATING'!N68","v":0},{"$f":"'5.1, 5.3 - HEATING'!O68","v":0},null,"See instructions in cell D8"]
[null,null,"• Cooling",{"$f":"'5.2, 5.4 - COOLING'!N48","v":0},{"$f":"'5.2, 5.4 - COOLING'!O48","v":0},{"$f":"'5.2, 5.4 - COOLING'!P48","v":0},null,"See instructions in cell D8"]
[null,"6.  Lighting",null,null,""]
[null,"(a) Occupancy Controls","All non-apartment spaces, except those where automatic shutoff would endanger the safety of occupants, must have occupancy sensors or automatic bi-level lighting controls. Automatic controls must be specified for spaces intended for 24-hour operation such as corridors and stairwells.",{"$f":"'6.1, 6.2, 6.3 - LIGHTING'!K97","v":0},{"$f":"'6.1, 6.2, 6.3 - LIGHTING'!L97","v":0},{"$f":"'6.1, 6.2, 6.3 - LIGHTING'!M97","v":0},null,"See instructions in cell D8"]
[null,"(b) Common Area Lighting",{"$f":"IF('Project Info'!$C$12=\"\",\"<Confirm if project is participating in NYSERDA MPP on Project Info tab>\",IF('Project Info'!$C$12=\"Yes\",'Prescriptive Path Checklist'!R104,'Prescriptive Path Checklist'!Q104))","v":"<Confirm if project is participating in NYSERDA MPP on Project Info tab>"},{"$f":"'6.1, 6.2, 6.3 - LIGHTING'!K98","v":0},{"$f":"'6.1, 6.2, 6.3 - LIGHTING'!L98","v":0},{"$f":"'6.1, 6.2, 6.3 - LIGHTING'!M98","v":0},null,"See instructions in cell D8",null,null,null,null,null,null,null,null,"80% of installed light fixtures must be ENERGY STAR certified or have ENERGY STAR certified lamps installed. Alternatively, 100% of installed light fixtures in common spaces must have high-efficacy lamps installed, as defined in Appendix B.","All light fixtures in non-apartments spaces, including hallways, stairwells, lobbies, elevators and decorative fixtures, shall have a combined lamp and ballast efficacies meeting or exceeding ENERGY STAR specifications.  Alternatively, T-5 or T-8 lamps with electronic ballasts or ENERGY STAR certified screw-in lamps may be used."]
[null,null,"Total specified lighting power for the combined non-apartment spaces must not exceed ASHRAE 90.1-2010 allowances for those combined spaces. \n\nLighting power densities and allowances must be determined using ASHRAE 90.1-2010, Table 9.5.1 or Table 9.6.1. Lighting controls may not be used to reduce the specified lighting power for compliance with this requirement. For senior living, an increase in lighting power densities and allowances corresponding to the increase in footcandles, is permitted.\n \nIf following the Prescriptive Path, when calculating overall lighting power density, use 1.1 W/ft2 for spaces where lighting is not installed.",{"$f":"'6.1, 6.2, 6.3 - LIGHTING'!K99","v":0},{"$f":"'6.1, 6.2, 6.3 - LIGHTING'!L99","v":0},{"$f":"'6.1, 6.2, 6.3 - LIGHTING'!M99","v":0},null,"See instructions in cell D8"]
[null,"(c) Exit Signs","All exit signs shall be specified as LED (not to exceed 5W per face) or photo-luminescent and shall conform to local building code; fixtures located above stairwell doors and other forms of egress shall contain a battery back-up feature.",{"$f":"'6.1, 6.2, 6.3 - LIGHTING'!K100","v":0},{"$f":"'6.1, 6.2, 6.3 - LIGHTING'!L100","v":0},{"$f":"'6.1, 6.2, 6.3 - LIGHTING'!M100","v":0},null,"See instructions in cell D8"]
[null,"(d) Exterior Lighting","Fixtures must include automatic switching on timers or photocell controls except fixtures intended for 24-hour operation, required for security, or located on apartment balconies.",{"$f":"'6.1, 6.2, 6.3 - LIGHTING'!K101","v":0},{"$f":"'6.1, 6.2, 6.3 - LIGHTING'!L101","v":0},{"$f":"'6.1, 6.2, 6.3 - LIGHTING'!M101","v":0},null,"See instructions in cell D8"]
[null,null,{"$f":"IF('Project Info'!$C$12=\"\",\"<Confirm if project is participating in NYSERDA MPP on Project Info tab>\",IF('Project Info'!$C$12=\"Yes\",'Prescriptive Path Checklist'!R108,'Prescriptive Path Checklist'!Q108))","v":"<Confirm if project is participating in NYSERDA MPP on Project Info tab>"},{"$f":"'6.1, 6.2, 6.3 - LIGHTING'!K102","v":0},{"$f":"'6.1, 6.2, 6.3 - LIGHTING'!L102","v":0},{"$f":"'6.1, 6.2, 6.3 - LIGHTING'!M102","v":0},null,"See instructions in cell D8",null,null,null,null,null,null,null,null,"80% of outdoor lighting fixtures shall be ENERGY STAR certified or have ENERGY STAR certified lamps installed. Alternatively, 100% of outdoor lighting fixtures must have high-efficacy lamps installed, as defined in Appendix B.","All outdoor lighting fixtures shall have combined lamp and ballast efficacies meeting or exceeding ENERGY STAR specifications."]
[null,null,"Total specified exterior lighting power cannot exceed ASHRAE 90.1-2010 allowances.                    ",{"$f":"'6.1, 6.2, 6.3 - LIGHTING'!K103","v":0},{"$f":"'6.1, 6.2, 6.3 - LIGHTING'!L103","v":0},{"$f":"'6.1, 6.2, 6.3 - LIGHTING'!M103","v":0},null,"See instructions in cell D8"]
[null,"(e) In-Unit Lighting",{"$f":"IF('Project Info'!$C$12=\"\",\"<Confirm if project is participating in NYSERDA MPP on Project Info tab>\",IF('Project Info'!$C$12=\"Yes\",'Prescriptive Path Checklist'!R110,'Prescriptive Path Checklist'!Q110))","v":"<Confirm if project is participating in NYSERDA MPP on Project Info tab>"},{"$f":"'6.1, 6.2, 6.3 - LIGHTING'!K104","v":0},{"$f":"'6.1, 6.2, 6.3 - LIGHTING'!L104","v":0},{"$f":"'6.1, 6.2, 6.3 - LIGHTING'!M104","v":0},null,"See instructions in cell D8",null,null,null,null,null,null,null,null,"80% of in-unit light fixtures must be ENERGY STAR certified or have ENERGY STAR certified lamps installed. Alternatively, 100% of in-unit light fixtures must have high-efficacy lamps installed, as defined in Appendix B.\n\nOverall in-unit lighting power density may not exceed 0.75 W/ft2. When calculating overall lighting power density, use 1.1 W/ft2 for spaces where lighting is not installed.","All hard-wired lighting fixtures and ceiling fans installed within apartments shall meet or exceed ENERGY STAR specifications.  ENERGY STAR certified screw-in lamps may be used in  the following applications only:  Closets, storage spaces, and other locations that are not within habitable living space.\n\nOverall in-unit lighting power density may not exceed 0.7 W/ft2. When calculating overall lighting power density, use 1.1 W/ft2 for spaces where lighting is not installed."]
[null,"(f) Illumination Levels","At a minimum, interior lighting must be designed to meet light levels (footcandles) by space type as recommended by the Illumination Engineering Society (IESNA) Lighting Handbook, 9th edition. Values for commonly used spaces are listed in the Prescriptive Path. For senior housing, minimum illumination requirements may follow recommendations in IESNA’s 2007 Lighting and the Visual Environment for Senior Living. See Appendix B of the Prescriptive Path to determine lamp lumens.",{"$f":"'6.1, 6.2, 6.3 - LIGHTING'!K28","v":0},{"$f":"'6.1, 6.2, 6.3 - LIGHTING'!L28","v":0},{"$f":"'6.1, 6.2, 6.3 - LIGHTING'!M28","v":0},null,"See instructions in cell D8"]
[null,"7.  Motors"]
[null,"(a) Heating Pump Motor Efficiency","All three-phase pump motors 1 horse-power or larger shall meet or exceed efficiency standards for NEMA Premium™ motors, where available.\n\nMotors 5 horse-power or larger for circulating pumps serving hydronic heating systems must be specified with variable frequency drives.",{"$f":"'7.1 - MOTORS'!J34","v":0},{"$f":"'7.1 - MOTORS'!K34","v":0},{"$f":"'7.1 - MOTORS'!L34","v":0},null,"See instructions in cell D8"]
[null,"(b) Cooling Pump Motor Efficiency","All three-phase pump motors 1 horse-power or larger shall meet or exceed efficiency standards for NEMA Premium™ motors, where available.\n\nMotors 5 horse-power or larger for circulating pumps serving hydronic cooling systems must be specified with variable frequency drives.\n\nCooling tower fan motors must be equipped with VFD controlled by a temperature sensor on the condenser water supply pipe.",{"$f":"'7.1 - MOTORS'!J35","v":0},{"$f":"'7.1 - MOTORS'!K35","v":0},{"$f":"'7.1 - MOTORS'!L35","v":0},null,"See instructions in cell D8"]
[null,"(c) DHW Pump Motor Efficiency","All three-phase pump motors 1 horse-power or larger shall meet or exceed efficiency standards for NEMA Premium™ motors, where available.",{"$f":"'7.1 - MOTORS'!J36","v":0},{"$f":"'7.1 - MOTORS'!K36","v":0},{"$f":"'7.1 - MOTORS'!L36","v":0},null,"See instructions in cell D8"]
[null,"8.  Ventilation & Infiltration"]
[null,"(a) Building Air Barrier","The building plans shall demonstrate a continuous, unbroken air barrier separating the conditioned space of the building from the exterior, unconditioned spaces within the building, commercial spaces, mechanical rooms vented with unconditioned air, mechanical chases opening to unconditioned spaces, elevator shafts, and garages or other vehicle/equipment storage facilities.",{"$f":"'8.1 - INF_EXT AIR BARRIER'!G47","v":0},{"$f":"'8.1 - INF_EXT AIR BARRIER'!H47","v":0},{"$f":"'8.1 - INF_EXT AIR BARRIER'!I47","v":0},null,"See instructions in cell D8"]
[null,"(b) Apartment Infiltration","Apartments shall be sealed to reduce air exchange between the apartment and outside as well as the apartment and other adjacent spaces.  A maximum air leakage rate of 0.30 CFM50 per square feet of enclosure is allowed.",{"$f":"'8.1 - INF_BLOWER DOOR TEST'!I33","v":0},{"$f":"'8.1 - INF_BLOWER DOOR TEST'!J33","v":0},{"$f":"'8.1 - INF_BLOWER DOOR TEST'!K33","v":0},null,"See instructions in cell D8"]
[null,"(c) Non-Apartment Ventilation","Common area ventilation systems shall be designed and tested to satisfy minimum requirements of ASHRAE 62.1-2007, without exceeding the minimum ventilation rates by more than 50%.",{"$f":"'8.2 - VENT_SCHEDULE&TAB REPORT'!O56","v":0},{"$f":"'8.2 - VENT_SCHEDULE&TAB REPORT'!P56","v":0},{"$f":"'8.2 - VENT_SCHEDULE&TAB REPORT'!Q56","v":0},null,"See instructions in cell D8"]
[null,null,"Central exhaust fans 1/16 HP and less must be direct-drive and have variable speed controllers.\n\nCentral exhaust fans greater than 1/16 HP and less than 1 HP must be direct-drive with ECM motors and variable speed controllers.\n\nCentral exhaust fans 1 HP and larger must have NEMA Premium efficient motors.",{"$f":"'8.2 - VENT_SCHEDULE&TAB REPORT'!O52","v":0},{"$f":"'8.2 - VENT_SCHEDULE&TAB REPORT'!P52","v":0},{"$f":"'8.2 - VENT_SCHEDULE&TAB REPORT'!Q52","v":0},null,"See instructions in cell D8"]
[null,null,"Powered common laundry ventilation must be installed with automatic demand control to turn off ventilation fans when no dryers are operating.  ",{"$f":"'8.2 - VENT_SCHEDULE&TAB REPORT'!O57","v":0},{"$f":"'8.2 - VENT_SCHEDULE&TAB REPORT'!P57","v":0},{"$f":"'8.2 - VENT_SCHEDULE&TAB REPORT'!Q57","v":0},null,"See instructions in cell D8"]
[null,"(d) In-Unit Ventilation",{"$f":"IF('Project Info'!$C$12=\"\",\"<Confirm if project is participating in NYSERDA MPP on Project Info tab>\",IF('Project Info'!$C$12=\"Yes\",'Prescriptive Path Checklist'!R122,'Prescriptive Path Checklist'!Q122))","v":"<Confirm if project is participating in NYSERDA MPP on Project Info tab>"},{"$f":"'8.2 - VENT_SCHEDULE&TAB REPORT'!O56","v":0},{"$f":"'8.2 - VENT_SCHEDULE&TAB REPORT'!P56","v":0},{"$f":"'8.2 - VENT_SCHEDULE&TAB REPORT'!Q56","v":0},null,"See instructions in cell D8",null,null,null,null,null,null,null,null,"Apartment ventilation and local exhaust systems shall be designed and tested to satisfy minimum requirements of Section 4.1 of ASHRAE 62.2-2007, without reliance on natural ventilation and without exceeding the minimum ventilation rates by more than 50%. ","Apartment ventilation and local exhaust systems shall be designed and tested to satisfy minimum requirements of Section 4.1 of ASHRAE 62.2-2007, without reliance on natural ventilation and without exceeding the minimum ventilation rates by more than 50%. \n\nOutdoor air must be provided to each unit directly from the outdoors.  Projects using exhaust ventilation systems must specify how outside air is delivered at the flow rate required by ASHRAE 62.2-2007.  Systems that rely on transfer air from pressurized hallways or corridors, adjacent to dwelling units, attics, etc., are prohibited."]
[null,null,"Central exhaust and in-line exhaust systems serving apartments must have self-balancing dampers at each register. ",{"$f":"'8.2 - VENT_SCHEDULE&TAB REPORT'!O65","v":0},{"$f":"'8.2 - VENT_SCHEDULE&TAB REPORT'!P65","v":0},{"$f":"'8.2 - VENT_SCHEDULE&TAB REPORT'!Q65","v":0},null,"See instructions in cell D8"]
[null,null,"Central exhaust fans 1/16 HP and less must be direct-drive and have variable speed controllers.\n\nCentral exhaust fans greater than 1/16 HP and less than 1 HP must be direct-drive with ECM motors and variable speed controllers.\n\nCentral exhaust fans 1 HP and larger must have NEMA Premium efficient motors.",{"$f":"'8.2 - VENT_SCHEDULE&TAB REPORT'!O53","v":0},{"$f":"'8.2 - VENT_SCHEDULE&TAB REPORT'!P53","v":0},{"$f":"'8.2 - VENT_SCHEDULE&TAB REPORT'!Q53","v":0},null,"See instructions in cell D8"]
[null,null,"Apartment in-line and ceiling exhaust fans must be ENERGY STAR certified.",{"$f":"'8.2 - VENT_SCHEDULE&TAB REPORT'!O54","v":0},{"$f":"'8.2 - VENT_SCHEDULE&TAB REPORT'!P54","v":0},{"$f":"'8.2 - VENT_SCHEDULE&TAB REPORT'!Q54","v":0},null,"See instructions in cell D8"]
[null,"(e) Duct sealing at joints and connections","Ventilation system ductwork shall be sealed at all transverse joints and connections including boot to wall/ceiling connections through drywall using UL-181 compliant materials and methods. Central exhaust systems that serve one or more apartments must be tested for duct leakage, which cannot exceed the sum of 2.5 CFM50 per register per shaft plus 2.5 CFM50 per floor per shaft.",{"$f":"'8.2 - VENT_DUCT TIGHTNESS'!G32","v":0},{"$f":"'8.2 - VENT_DUCT TIGHTNESS'!H32","v":0},{"$f":"'8.2 - VENT_DUCT TIGHTNESS'!I32","v":0},null,"See instructions in cell D8"]
[null,null,"Ductwork penetrating the building envelope shall be sealed to prevent air leakage through the duct system and/or the building envelope. This includes but is not limited to roof curbs and exterior wall exhaust/intake vents.",{"$f":"'8.2 - VENT_DUCT TIGHTNESS'!G33","v":0},{"$f":"'8.2 - VENT_DUCT TIGHTNESS'!H33","v":0},{"$f":"'8.2 - VENT_DUCT TIGHTNESS'!I33","v":0},null,"See instructions in cell D8"]
[null,"(f) Garage Ventilation Control","When garage exhaust is required by code, CO and NO2 sensors must be installed that control exhaust fan operation.",{"$f":"'8.2 - VENT_SCHEDULE&TAB REPORT'!O61","v":0},{"$f":"'8.2 - VENT_SCHEDULE&TAB REPORT'!P61","v":0},{"$f":"'8.2 - VENT_SCHEDULE&TAB REPORT'!Q61","v":0},null,"See instructions in cell D8"]
[null,"9.  Metering"]
[null,"(a) Nonresidential Associated Spaces","Post-construction, the utility consumption of the residential-associated spaces must be capable of evaluation independent of any commercial/retail spaces. These nonresidential associated parts of the building shall be separately metered (or sub-metered) for electricity, gas, fuel oil, water, steam, and hot water for domestic and/or space heating purposes.",{"$f":"'9.1 - METERS'!J29","v":0},{"$f":"'9.1 - METERS'!K29","v":0},{"$f":"'9.1 - METERS'!L29","v":0},null,"See instructions in cell D8"]
[null,"(b) Direct-Metered Utilities","For buildings that are direct-metered for utilities to the apartments, the building owner must secure signed releases from individual apartment occupants to allow for benchmarking or find alternative methods to assessing whole building energy consumption, such as a whole-building meter or asking the utility for aggregated data. All data uploaded to Portfolio Manager is strictly confidential and only used to estimate the energy performance of the building as a whole, not of individual apartments. ","N/A","N/A",{"$f":"'9.1 - METERS'!L32","v":0},null,"See instructions in cell D8"]
[null,"[1] Many motors are NEMA labeled and this label alone does not ensure that a motor is energy-efficient.  This requirement refers specifically to the NEMA Premium energy efficient motors program.  Participating companies may be found at:"]
[null,"http://www.nema.org/Policy/Energy/Efficiency/Documents/NEMA_Premium_Partners.pdf"]

{"sheet":"Prescriptive Tables 1, 2 & 3","index":7,"n_rows":89,"n_cols":22,"rows_kept":89,"cut":false,"hidden":true,"merged":[[2,1,3,1],[63,1,63,3],[65,1,65,3],[56,1,56,3],[60,1,60,3],[44,1,44,3],[48,1,48,3],[53,1,53,3],[42,5,42,12],[37,1,37,22],[38,1,38,22],[39,1,39,22],[42,14,42,21],[42,1,43,1],[74,14,74,21],[82,1,82,3],[84,1,84,3],[87,1,87,3],[74,5,74,12],[74,1,75,1],[76,1,76,3],[78,1,78,3],[80,1,80,3]]}
[]
[null,"Table 1 ENERGY STAR MFHR Prescriptive Path – Minimum Heating and Cooling Equipment Efficiencies"]
[null,"Equipment Type","Minimum Efficiency per ASHRAE 90.1 2007 Climate Zones",null,null,"Minimum Efficiency per ASHRAE 90.1 2007 Climate Zones"]
[null,null,{"$f":"IF('Project Info'!C8=\"\",\"<select climate zone on 'Project Info' tab>\",\"Climate Zone \"&'Project Info'!C8)","v":"<select climate zone on 'Project Info' tab>"},null,null,"Climate Zone 1","Climate Zone 2","Climate Zone 3","Climate Zone 4","Climate Zone 5","Climate Zone 6","Climate Zone 7","Climate Zone 8"]
[null,"Room AC ( window, through-wall, ductless  mini-splits)",{"$f":"HLOOKUP($C$4,$F$4:$M$37,2,FALSE)","v":{"$error":"#N/A"}},null,null,"ENERGY STAR certified ","ENERGY STAR certified ","ENERGY STAR certified ","ENERGY STAR certified ","ENERGY STAR certified ","ENERGY STAR certified ","ENERGY STAR certified ","ENERGY STAR certified "]
[null,"Air conditioner (<13 KBtu/h)",{"$f":"HLOOKUP($C$4,$F$4:$M$37,3,FALSE)","v":{"$error":"#N/A"}},null,null,"13 SEER ","13 SEER ","13 SEER ",{"$f":"IF('Project Info'!$C$12=\"Yes\",\"ENERGY STAR certified\",\"13 SEER\")","v":"13 SEER"},{"$f":"IF('Project Info'!$C$12=\"Yes\",\"ENERGY STAR certified\",\"13 SEER\")","v":"13 SEER"},{"$f":"IF('Project Info'!$C$12=\"Yes\",\"ENERGY STAR certified\",\"13 SEER\")","v":"13 SEER"},"13 SEER ","13 SEER "]
[null,"Air conditioner (≥13 and <65 KBtu/h)",{"$f":"HLOOKUP($C$4,$F$4:$M$37,4,FALSE)","v":{"$error":"#N/A"}},null,null,"16 SEER","16 SEER","ENERGY STAR certified ","ENERGY STAR certified ","ENERGY STAR certified ",{"$f":"IF('Project Info'!$C$12=\"Yes\",\"ENERGY STAR certified\",\"13 SEER\")","v":"13 SEER"},"13 SEER ","13 SEER "]
[null,"Air conditioner ((≥65 and <240 KBtu/h)",{"$f":"HLOOKUP($C$4,$F$4:$M$37,5,FALSE)","v":{"$error":"#N/A"}},null,null,"11.5 EER/12.0 IEER","11.5 EER/12.0 IEER","11.5 EER/12.0 IEER","11.5 EER/12.0 IEER","11.5 EER/12.0 IEER","11.5 EER/12.0 IEER","11.5 EER/12.0 IEER","11.5 EER/12.0 IEER"]
[null,"Air conditioner (≥240  and < 760 KBtu/h)",{"$f":"HLOOKUP($C$4,$F$4:$M$37,6,FALSE)","v":{"$error":"#N/A"}},null,null,"10.0 EER/10.5 IEER","10.0 EER/10.5 IEER","10.0 EER/10.5 IEER","10.0 EER/10.5 IEER","10.0 EER/10.5 IEER","10.0 EER/10.5 IEER","10.0 EER/10.5 IEER","10.0 EER/10.5 IEER"]
[null,"Electric resistance space heating",{"$f":"HLOOKUP($C$4,$F$4:$M$37,7,FALSE)","v":{"$error":"#N/A"}},null,null,"Not permitted in any space using the Prescriptive Path ","Not permitted in any space using this approach ","Not permitted in any space using this approach ","Not permitted in any space using this approach ","Not permitted in any space using this approach ","Not permitted in any space using this approach ","Not permitted in any space using this approach ","Not permitted in any space using this approach "]
[null,"Warm-Air Furnace (<225 KBtu/h, common areas)",{"$f":"HLOOKUP($C$4,$F$4:$M$37,8,FALSE)","v":{"$error":"#N/A"}},null,null,"78% AFUE or 80% Et","78% AFUE or 80% Et","78% AFUE or 80% Et",{"$f":"IF('Project Info'!$C$12=\"Yes\",\"ENERGY STAR certified\",\"78% AFUE or 80% Et\")","v":"78% AFUE or 80% Et"},{"$f":"IF('Project Info'!$C$12=\"Yes\",\"ENERGY STAR certified\",\"78% AFUE or 80% Et\")","v":"78% AFUE or 80% Et"},{"$f":"IF('Project Info'!$C$12=\"Yes\",\"ENERGY STAR certified\",\"78% AFUE or 80% Et\")","v":"78% AFUE or 80% Et"},"78% AFUE or 80% Et","78% AFUE or 80% Et"]
[null,"Warm-Air Furnace (>225 KBtu/h)",{"$f":"HLOOKUP($C$4,$F$4:$M$37,9,FALSE)","v":{"$error":"#N/A"}},null,null,"80% Et (gas)    or 81% Et (oil)","80% Et (gas)    or 81% Et (oil)","80% Et (gas)    or 81% Et (oil)","80% Et (gas)    or 81% Et (oil)","80% Et (gas)    or 81% Et (oil)","80% Et (gas)    or 81% Et (oil)","80% Et (gas)    or 81% Et (oil)","80% Et (gas)    or 81% Et (oil)"]
[null,"Packaged Terminal Air Conditioner (PTAC)",{"$f":"HLOOKUP($C$4,$F$4:$M$37,10,FALSE)","v":{"$error":"#N/A"}},null,null,"13.8 – (0.300 X Cap/1000) EER","13.8 – (0.300 X Cap/1000) EER","13.8 – (0.300 X Cap/1000) EER","13.8 – (0.300 X Cap/1000) EER","13.8 – (0.300 X Cap/1000) EER","13.8 – (0.300 X Cap/1000) EER","13.8 – (0.300 X Cap/1000) EER","13.8 – (0.300 X Cap/1000) EER"]
[null,"Packaged Terminal Heat Pump (PTHP) ",{"$f":"HLOOKUP($C$4,$F$4:$M$37,11,FALSE)","v":{"$error":"#N/A"}},null,null,"Cooling: 14.0– (0.3 X Cap/1000) EER        Heating:  3.7– (0.052 X Cap/1000) COP","Cooling: 14.0– (0.3 X Cap/1000) EER        Heating:  3.7– (0.052 X Cap/1000) COP","Cooling: 14.0– (0.3 X Cap/1000) EER        Heating:  3.7– (0.052 X Cap/1000) COP","Cooling: 14.0– (0.3 X Cap/1000) EER        Heating:  3.7– (0.052 X Cap/1000) COP","Cooling: 14.0– (0.3 X Cap/1000) EER        Heating:  3.7– (0.052 X Cap/1000) COP","Cooling: 14.0– (0.3 X Cap/1000) EER        Heating:  3.7– (0.052 X Cap/1000) COP","Cooling: 14.0– (0.3 X Cap/1000) EER        Heating:  3.7– (0.052 X Cap/1000) COP","Cooling: 14.0– (0.3 X Cap/1000) EER        Heating:  3.7– (0.052 X Cap/1000) COP"]
[null,"Air cooled heat pump (≥13 and <65 KBtu/h)",{"$f":"HLOOKUP($C$4,$F$4:$M$37,12,FALSE)","v":{"$error":"#N/A"}},null,null,"15.0 SEER/ 12.5 EER/ 8.2 HSPF","15.0 SEER/ 12.5 EER/ 8.2 HSPF","ENERGY STAR certified\n8.2HSPF ","ENERGY STAR certified\n8.5HSPF ","ENERGY STAR certified\n9.25HSPF ","ENERGY STAR certified\n9.5HSPF ","Duel fuel back-up","Duel fuel back-up"]
[null,"Air cooled heat pump (≥65 and <240 KBtu/h)",{"$f":"HLOOKUP($C$4,$F$4:$M$37,13,FALSE)","v":{"$error":"#N/A"}},null,null,"Cooling: 11.1 EER/11.6 IEER                     Heating: 3.3 COP (@47°F DB)","Cooling: 11.1 EER/11.6 IEER                     Heating: 3.3 COP (@47°F DB)","Cooling: 11.1 EER/11.6 IEER                     Heating: 3.3 COP (@47°F DB)","Cooling: 11.1 EER/11.6 IEER                     Heating: 3.3 COP (@47°F DB)","Cooling: 11.1 EER/11.6 IEER                     Heating: 3.3 COP (@47°F DB)","Cooling: 11.1 EER/11.6 IEER                     Heating: 3.3 COP (@47°F DB)","Cooling: 11.1 EER/11.6 IEER                     Heating: 3.3 COP (@47°F DB)","Cooling: 11.1 EER/11.6 IEER                     Heating: 3.3 COP (@47°F DB)"]
[null,"Air cooled heat pump (≥240 KBtu/h)",{"$f":"HLOOKUP($C$4,$F$4:$M$37,14,FALSE)","v":{"$error":"#N/A"}},null,null,"Cooling:   9.6 EER/9.6 IEER                      Heating: 3.2 COP (@47°F DB)","Cooling:   9.6 EER/9.6 IEER                      Heating: 3.2 COP (@47°F DB)","Cooling:   9.6 EER/9.6 IEER                      Heating: 3.2 COP (@47°F DB)","Cooling:   9.6 EER/9.6 IEER                      Heating: 3.2 COP (@47°F DB)","Cooling:   9.6 EER/9.6 IEER                      Heating: 3.2 COP (@47°F DB)","Cooling:   9.6 EER/9.6 IEER                      Heating: 3.2 COP (@47°F DB)","Cooling:   9.6 EER/9.6 IEER                      Heating: 3.2 COP (@47°F DB)","Cooling:   9.6 EER/9.6 IEER                      Heating: 3.2 COP (@47°F DB)"]
[null,"Water-source  heat pump (<135 KBtu/h)",{"$f":"HLOOKUP($C$4,$F$4:$M$37,15,FALSE)","v":{"$error":"#N/A"}},null,null,"Cooling: 14.0 EER(86°F entering water) Heating: 4.2 COP(68°F entering water)","Cooling: 14.0 EER(86°F entering water) Heating: 4.2 COP(68°F entering water)","Cooling: 14.0 EER(86°F entering water) Heating: 4.2 COP(68°F entering water)","Cooling: 14.0 EER(86°F entering water) Heating: 4.2 COP(68°F entering water)","Cooling: 14.0 EER(86°F entering water) Heating: 4.2 COP(68°F entering water)","Cooling: 14.0 EER(86°F entering water) Heating: 4.2 COP(68°F entering water)","Cooling: 14.0 EER(86°F entering water) Heating: 4.2 COP(68°F entering water)","Cooling: 14.0 EER(86°F entering water) Heating: 4.2 COP(68°F entering water)"]
[null,"Boilers, hot water (<300,000 Btu/h)",{"$f":"HLOOKUP($C$4,$F$4:$M$37,16,FALSE)","v":{"$error":"#N/A"}},null,null,"85% AFUE ","85% AFUE ","85% AFUE ",{"$f":"IF('Project Info'!$C$12=\"Yes\",\"ENERGY STAR certified\",\"85% AFUE\")","v":"85% AFUE"},{"$f":"IF('Project Info'!$C$12=\"Yes\",\"ENERGY STAR certified\",\"85% AFUE\")","v":"85% AFUE"},"90% AFUE ","90% AFUE ","90% AFUE "]
[null,"Boilers, hot water (≥300,000 Btu/h)",{"$f":"HLOOKUP($C$4,$F$4:$M$37,17,FALSE)","v":{"$error":"#N/A"}},null,null,"87% Et  (86% Et with additional requirements; \n89% Et if using heat pumps)","87% Et  (86% Et with additional requirements; \n89% Et if using heat pumps)","87% Et  (86% Et with additional requirements; \n89% Et if using heat pumps)","87% Et  (86% Et with additional requirements; \n89% Et if using heat pumps)","87% Et  (86% Et with additional requirements; \n89% Et if using heat pumps)","87% Et  (86% Et with additional requirements; \n89% Et if using heat pumps)","87% Et  (86% Et with additional requirements; \n89% Et if using heat pumps)","87% Et  (86% Et with additional requirements; \n89% Et if using heat pumps)"]
[null,"VRF Air Conditioners and Heat Pumps",{"$f":"HLOOKUP($C$4,$F$4:$M$37,18,FALSE)","v":{"$error":"#N/A"}},null,null,"See Tables 6.8.1I and 6.8.1J of ASHRAE 90.1-2010","See Tables 6.8.1I and 6.8.1J of ASHRAE 90.1-2010","See Tables 6.8.1I and 6.8.1J of ASHRAE 90.1-2010","See Tables 6.8.1I and 6.8.1J of ASHRAE 90.1-2010","See Tables 6.8.1I and 6.8.1J of ASHRAE 90.1-2010","See Tables 6.8.1I and 6.8.1J of ASHRAE 90.1-2010","See Tables 6.8.1I and 6.8.1J of ASHRAE 90.1-2010","See Tables 6.8.1I and 6.8.1J of ASHRAE 90.1-2010"]
[null,"Air-cooled chillers with or without condenser ",{"$f":"HLOOKUP($C$4,$F$4:$M$37,19,FALSE)","v":{"$error":"#N/A"}},null,null,"10.0 EER / 12.5 IPLV ","10.0 EER / 12.5 IPLV ","10.0 EER / 12.5 IPLV ","10.0 EER / 12.5 IPLV ","10.0 EER / 12.5 IPLV ","10.0 EER / 12.5 IPLV ","10.0 EER / 12.5 IPLV ","10.0 EER / 12.5 IPLV "]
[null,"Water-cooled chiller, positive displacement (<75 tons)",{"$f":"HLOOKUP($C$4,$F$4:$M$37,20,FALSE)","v":{"$error":"#N/A"}},null,null,"0.780 kW/ton (Full load) /  0.630 kW/ton (IPLV) ","0.780 kW/ton (Full load) /  0.630 kW/ton (IPLV) ","0.780 kW/ton (Full load) /  0.630 kW/ton (IPLV) ","0.780 kW/ton (Full load) /  0.630 kW/ton (IPLV) ","0.780 kW/ton (Full load) /  0.630 kW/ton (IPLV) ","0.780 kW/ton (Full load) /  0.630 kW/ton (IPLV) ","0.780 kW/ton (Full load) /  0.630 kW/ton (IPLV) ","0.780 kW/ton (Full load) /  0.630 kW/ton (IPLV) "]
[null,"Water-cooled chiller, positive displacement (75-150 tons)",{"$f":"HLOOKUP($C$4,$F$4:$M$37,21,FALSE)","v":{"$error":"#N/A"}},null,null,"0.775 kW/ton (Full load) /  0.615 kW/ton (IPLV) ","0.775 kW/ton (Full load) /  0.615 kW/ton (IPLV) ","0.775 kW/ton (Full load) /  0.615 kW/ton (IPLV) ","0.775 kW/ton (Full load) /  0.615 kW/ton (IPLV) ","0.775 kW/ton (Full load) /  0.615 kW/ton (IPLV) ","0.775 kW/ton (Full load) /  0.615 kW/ton (IPLV) ","0.775 kW/ton (Full load) /  0.615 kW/ton (IPLV) ","0.775 kW/ton (Full load) /  0.615 kW/ton (IPLV) "]
[null,"Water-cooled chiller, positive displacement (150-300tons)",{"$f":"HLOOKUP($C$4,$F$4:$M$37,22,FALSE)","v":{"$error":"#N/A"}},null,null,"0.680 kW/ton (Full load) /  0.580 kW/ton (IPLV) ","0.680 kW/ton (Full load) /  0.580 kW/ton (IPLV) ","0.680 kW/ton (Full load) /  0.580 kW/ton (IPLV) ","0.680 kW/ton (Full load) /  0.580 kW/ton (IPLV) ","0.680 kW/ton (Full load) /  0.580 kW/ton (IPLV) ","0.680 kW/ton (Full load) /  0.580 kW/ton (IPLV) ","0.680 kW/ton (Full load) /  0.580 kW/ton (IPLV) ","0.680 kW/ton (Full load) /  0.580 kW/ton (IPLV) "]
[null,"Water-cooled chiller, positive displacement (>300 tons)",{"$f":"HLOOKUP($C$4,$F$4:$M$37,23,FALSE)","v":{"$error":"#N/A"}},null,null,"0.620 kW/ton (Full load) /  0.540 kW/ton (IPLV) ","0.620 kW/ton (Full load) /  0.540 kW/ton (IPLV) ","0.620 kW/ton (Full load) /  0.540 kW/ton (IPLV) ","0.620 kW/ton (Full load) /  0.540 kW/ton (IPLV) ","0.620 kW/ton (Full load) /  0.540 kW/ton (IPLV) ","0.620 kW/ton (Full load) /  0.540 kW/ton (IPLV) ","0.620 kW/ton (Full load) /  0.540 kW/ton (IPLV) ","0.620 kW/ton (Full load) /  0.540 kW/ton (IPLV) "]
[null,"Water-cooled, centrifugal ( <300  tons)",{"$f":"HLOOKUP($C$4,$F$4:$M$37,24,FALSE)","v":{"$error":"#N/A"}},null,null,"0.634 kW/ton (Full load) /  0.596 kW/ton (IPLV)","0.634 kW/ton (Full load) /  0.596 kW/ton (IPLV)","0.634 kW/ton (Full load) /  0.596 kW/ton (IPLV)","0.634 kW/ton (Full load) /  0.596 kW/ton (IPLV)","0.634 kW/ton (Full load) /  0.596 kW/ton (IPLV)","0.634 kW/ton (Full load) /  0.596 kW/ton (IPLV)","0.634 kW/ton (Full load) /  0.596 kW/ton (IPLV)","0.634 kW/ton (Full load) /  0.596 kW/ton (IPLV)"]
[null,"Water-cooled, centrifugal (≥300 and <600  tons)",{"$f":"HLOOKUP($C$4,$F$4:$M$37,25,FALSE)","v":{"$error":"#N/A"}},null,null,"0.576 kW/ton (Full load) /  0.549 kW/ton (IPLV)","0.576 kW/ton (Full load) /  0.549 kW/ton (IPLV)","0.576 kW/ton (Full load) /  0.549 kW/ton (IPLV)","0.576 kW/ton (Full load) /  0.549 kW/ton (IPLV)","0.576 kW/ton (Full load) /  0.549 kW/ton (IPLV)","0.576 kW/ton (Full load) /  0.549 kW/ton (IPLV)","0.576 kW/ton (Full load) /  0.549 kW/ton (IPLV)","0.576 kW/ton (Full load) /  0.549 kW/ton (IPLV)"]
[null,"Water-cooled, centrifugal (≥600 tons)",{"$f":"HLOOKUP($C$4,$F$4:$M$37,26,FALSE)","v":{"$error":"#N/A"}},null,null,"0.570 kW/ton (Full load) /  0.539 kW/ton (IPLV)","0.570 kW/ton (Full load) /  0.539 kW/ton (IPLV)","0.570 kW/ton (Full load) /  0.539 kW/ton (IPLV)","0.570 kW/ton (Full load) /  0.539 kW/ton (IPLV)","0.570 kW/ton (Full load) /  0.539 kW/ton (IPLV)","0.570 kW/ton (Full load) /  0.539 kW/ton (IPLV)","0.570 kW/ton (Full load) /  0.539 kW/ton (IPLV)","0.570 kW/ton (Full load) /  0.539 kW/ton (IPLV)"]
[null,"Air-cooled absorption single effect chiller",{"$f":"HLOOKUP($C$4,$F$4:$M$37,27,FALSE)","v":{"$error":"#N/A"}},null,null,"0.6 COP","0.6 COP","0.6 COP","0.6 COP","0.6 COP","0.6 COP","0.6 COP","0.6 COP"]
[null,"Water-cooled absorption single effect chiller",{"$f":"HLOOKUP($C$4,$F$4:$M$37,28,FALSE)","v":{"$error":"#N/A"}},null,null,"0.70 COP","0.70 COP","0.70 COP","0.70 COP","0.70 COP","0.70 COP","0.70 COP","0.70 COP"]
[null,"Absorption double effect indirect-fired chiller",{"$f":"HLOOKUP($C$4,$F$4:$M$37,29,FALSE)","v":{"$error":"#N/A"}},null,null,"1.00 COP / 1.05 IPLV","1.00 COP / 1.05 IPLV","1.00 COP / 1.05 IPLV","1.00 COP / 1.05 IPLV","1.00 COP / 1.05 IPLV","1.00 COP / 1.05 IPLV","1.00 COP / 1.05 IPLV","1.00 COP / 1.05 IPLV"]
[null,"Absorption double effect direct-fired chiller",{"$f":"HLOOKUP($C$4,$F$4:$M$37,30,FALSE)","v":{"$error":"#N/A"}},null,null,"1.00 COP / 1.00 IPLV","1.00 COP / 1.00 IPLV","1.00 COP / 1.00 IPLV","1.00 COP / 1.00 IPLV","1.00 COP / 1.00 IPLV","1.00 COP / 1.00 IPLV","1.00 COP / 1.00 IPLV","1.00 COP / 1.00 IPLV"]
[null,"Open-loop propeller or axial fan cooling towers2",{"$f":"HLOOKUP($C$4,$F$4:$M$37,31,FALSE)","v":{"$error":"#N/A"}},null,null,">40 gpm/hp (@95°F entering water, 85°F leaving water, 75°F web entering air)",">40 gpm/hp (@95°F entering water, 85°F leaving water, 75°F web entering air)",">40 gpm/hp (@95°F entering water, 85°F leaving water, 75°F web entering air)",">40 gpm/hp (@95°F entering water, 85°F leaving water, 75°F web entering air)",">40 gpm/hp (@95°F entering water, 85°F leaving water, 75°F web entering air)",">40 gpm/hp (@95°F entering water, 85°F leaving water, 75°F web entering air)",">40 gpm/hp (@95°F entering water, 85°F leaving water, 75°F wb entering air)",">40 gpm/hp (@95°F entering water, 85°F leaving water, 75°F wb entering air)"]
[null,"Closed-loop propeller or axial fan cooling towers2",{"$f":"HLOOKUP($C$4,$F$4:$M$37,32,FALSE)","v":{"$error":"#N/A"}},null,null,">15 gpm/hp (@102°F entering water, 90°F leaving water, 75°F wb entering air)",">15 gpm/hp (@102°F entering water, 90°F leaving water, 75°F wb entering air)",">15 gpm/hp (@102°F entering water, 90°F leaving water, 75°F wb entering air)",">15 gpm/hp (@102°F entering water, 90°F leaving water, 75°F wb entering air)",">15 gpm/hp (@102°F entering water, 90°F leaving water, 75°F wb entering air)",">15 gpm/hp (@102°F entering water, 90°F leaving water, 75°F wb entering air)",">15 gpm/hp (@102°F entering water, 90°F leaving water, 75°F wb entering air)",">15 gpm/hp (@102°F entering water, 90°F leaving water, 75°F wb entering air)"]
[null,"Open-loop centrifugal fan cooling towers2",{"$f":"HLOOKUP($C$4,$F$4:$M$37,33,FALSE)","v":{"$error":"#N/A"}},null,null,">22 gpm/hp (@95°F entering water, 85°F leaving water, 75°F wb entering air)",">22 gpm/hp (@95°F entering water, 85°F leaving water, 75°F wb entering air)",">22 gpm/hp (@95°F entering water, 85°F leaving water, 75°F wb entering air)",">22 gpm/hp (@95°F entering water, 85°F leaving water, 75°F wb entering air)",">22 gpm/hp (@95°F entering water, 85°F leaving water, 75°F wb entering air)",">22 gpm/hp (@95°F entering water, 85°F leaving water, 75°F wb entering air)",">22 gpm/hp (@95°F entering water, 85°F leaving water, 75°F wb entering air)",">22 gpm/hp (@95°F entering water, 85°F leaving water, 75°F wb entering air)"]
[null,"Closed-loop centrifugal fan cooling towers2",{"$f":"HLOOKUP($C$4,$F$4:$M$37,34,FALSE)","v":{"$error":"#N/A"}},null,null,">8 gpm/hp (@102°F entering water, 90°F leaving water, 75°F wb entering air)",">8 gpm/hp (@102°F entering water, 90°F leaving water, 75°F wb entering air)",">8 gpm/hp (@102°F entering water, 90°F leaving water, 75°F wb entering air)",">8 gpm/hp (@102°F entering water, 90°F leaving water, 75°F wb entering air)",">8 gpm/hp (@102°F entering water, 90°F leaving water, 75°F wb entering air)",">8 gpm/hp (@102°F entering water, 90°F leaving water, 75°F wb entering air)",">8 gpm/hp (@102°F entering water, 90°F leaving water, 75°F wb entering air)",">8 gpm/hp (@102°F entering water, 90°F leaving water, 75°F wb entering air)"]
[null,"1.    In Climates Zones 1 through 6, if the prescriptive Heating Season Performance Factors are met for air-source heat pumps, electric resistance back-up heating is allowed, if programmable thermostats with adaptive recovery technology are installed."]
[null,"2.     In Climate Zone 7 and 8, dual-fuel backup is not required for ENERGY STAR certified heat pumps that have no backup heating because the heat pump is capable of meeting 100% of the design heating load. "]
[null,"3.     Cooling tower fan motors must be equipped with VFD controlled by a temperature sensor on the condenser water supply pipe."]
[]
[null,"Tables 2 & 3 Climate Specific Envelope Requirements for Climate Zones 1-8"]
[null,"Envelope Component","Nominal   R Value (Minimum)","Assembly U-Value (maximum)",null,"Nominal   R Value (Minimum)",null,null,null,null,null,null,null,null,"Assembly U-Value (maximum)"]
[null,null,{"$f":"IF('Project Info'!C8=\"\",\"<select climate zone on 'Project Info' tab>\",\"Climate Zone \"&'Project Info'!C8)","v":"<select climate zone on 'Project Info' tab>"},{"$f":"IF('Project Info'!C8=\"\",\"<select climate zone on 'Project Info' tab>\",\"Climate Zone \"&'Project Info'!C8)","v":"<select climate zone on 'Project Info' tab>"},null,"Climate Zone 1","Climate Zone 2","Climate Zone 3","Climate Zone 4","Climate Zone 5","Climate Zone 6","Climate Zone 7","Climate Zone 8",null,"Climate Zone 1","Climate Zone 2","Climate Zone 3","Climate Zone 4","Climate Zone 5","Climate Zone 6","Climate Zone 7","Climate Zone 8"]
[null,"Roof Insulation"]
[null,"Insulation entirely above deck",{"$f":"HLOOKUP($C$44,$F$44:$M$71,3,FALSE)","v":{"$error":"#N/A"}},{"$f":"HLOOKUP($D$44,$O$44:$V$71,3,FALSE)","v":{"$error":"#N/A"}},null,"R-25.0 continuous","R-25.0 continuous","R-25.0 continuous","R-25.0 continuous","R-25.0 continuous","R-30.0 continuous","R-35.0 continuous","R-35.0 continuous",null,"U-0.039","U-0.039","U-0.039","U-0.039","U-0.039","U-0.032","U-0.028","U-0.028"]
[null,"Metal Building",{"$f":"HLOOKUP($C$44,$F$44:$M$71,4,FALSE)","v":{"$error":"#N/A"}},{"$f":"HLOOKUP($D$44,$O$44:$V$71,4,FALSE)","v":{"$error":"#N/A"}},null,"R-19.0 +    R-11.0 Ls","R-19.0 +    R-11.0 Ls","R-19.0 +    R-11.0 Ls","R-19.0 +    R-11.0 Ls","R-19.0 +    R-11.0 Ls","R-25.0 +    R-11.0 Ls","R-30.0 +    R-11.0 Ls","R-30.0 +    R-11.0 Ls",null,"U-0.035","U-0.035","U-0.035","U-0.035","U-0.035","U-0.031","U-0.029","U-0.029"]
[null,"Attic and Other",{"$f":"HLOOKUP($C$44,$F$44:$M$71,5,FALSE)","v":{"$error":"#N/A"}},{"$f":"HLOOKUP($D$44,$O$44:$V$71,5,FALSE)","v":{"$error":"#N/A"}},null,"R-49.0","R-49.0","R-49.0","R-49.0","R-49.0","R-49.0","R-60.0","R-60.0",null,"U-0.021","U-0.021","U-0.021","U-0.021","U-0.021","U-0.021","U-0.017","U-0.017"]
[null,"Above Grade Wall Insulation"]
[null,"Mass",{"$f":"HLOOKUP($C$44,$F$44:$M$71,7,FALSE)","v":{"$error":"#N/A"}},{"$f":"HLOOKUP($D$44,$O$44:$V$71,7,FALSE)","v":{"$error":"#N/A"}},null,"R-7.6 continuous","R-9.5 continuous","R-11.4 continuous","R-13.3 continuous","R-15.2 continuous","R-20.0 continuous","R-20.0 continuous","R-31.3 continuous",null,"U-0.123","U-0.104","U-0.090","U-0.080","U-0.071","U-0.060","U-0.060","U-0.043"]
[null,"Metal Building",{"$f":"HLOOKUP($C$44,$F$44:$M$71,8,FALSE)","v":{"$error":"#N/A"}},{"$f":"HLOOKUP($D$44,$O$44:$V$71,8,FALSE)","v":{"$error":"#N/A"}},null,"R-13.0 +    R-6.5 ci","R-13.0 +  R-13.0 ci","R-13.0 +  R-13.0 ci","R-13.0 +  R-13.0 ci","R-13.0 +  R-13.0 ci","R-13.0 +  R-13.0 ci","R-13.0 +  R-19.5 ci","R-13.0 +  R-26.0 ci",null,"U-0.079","U-0.052","U-0.052","U-0.052","U-0.052","U-0.052","U-0.039","U-0.031"]
[null,"Steel-Framed",{"$f":"HLOOKUP($C$44,$F$44:$M$71,9,FALSE)","v":{"$error":"#N/A"}},{"$f":"HLOOKUP($D$44,$O$44:$V$71,9,FALSE)","v":{"$error":"#N/A"}},null,"R-13.0 + R-5.0 c.i.","R-13.0 +  R-10.0 ci","R-13.0 +  R-10.0 ci","R-13.0 + R-10.0 c.i.","R-13.0 + R-10.0 c.i.","R-13.0 + R-10.0 c.i.","R-13.0 +  R-18.8 ci","R-13.0 +  R-21.9 ci",null,"U-0.077","U-0.055","U-0.055","U-0.055","U-0.055","U-0.055","U-0.037","U-0.033"]
[null,"Wood-framed and other",{"$f":"HLOOKUP($C$44,$F$44:$M$71,10,FALSE)","v":{"$error":"#N/A"}},{"$f":"HLOOKUP($D$44,$O$44:$V$71,10,FALSE)","v":{"$error":"#N/A"}},null,"R-13.0 +    R-3.8 ci","R-13.0 +  R-3.8 ci","R-13.0 +  R-3.8 ci","R-13.0 +  R-7.5 ci","R-13.0 + R-10.0 c.i.","R-13.0 + R-10.0 c.i.","R-13.0 +  R-21.9 ci.","R-13.0 +  R-18.8 ci",null,"U-0.064","U-0.064","U-0.064","U-0.051","U-0.045","U-0.045","U-0.045","U-0.032"]
[null,"Below Grade Wall Insulation"]
[null,"Conditioned and Indirectly Conditioned space",{"$f":"HLOOKUP($C$44,$F$44:$M$71,12,FALSE)","v":{"$error":"#N/A"}},{"$f":"HLOOKUP($D$44,$O$44:$V$71,12,FALSE)","v":{"$error":"#N/A"}},null,"NR","NR","NR","R-10.0 continuous","R-10.0 continuous ","R-10.0 continuous ","R-12.5 continuous","R-15.0 continuous",null,"NR","NR","NR","U-0.092","U-0.092","U-0.092","U-0.075","U-0.063"]
[null,"Unconditioned space",{"$f":"HLOOKUP($C$44,$F$44:$M$71,13,FALSE)","v":{"$error":"#N/A"}},{"$f":"HLOOKUP($D$44,$O$44:$V$71,13,FALSE)","v":{"$error":"#N/A"}},null,"NR","NR","NR","NR","NR","NR","NR","NR",null,"NR","NR","NR","NR","NR","NR","NR","NR"]
[null,"Floor Insulation"]
[null,"Mass",{"$f":"HLOOKUP($C$44,$F$44:$M$71,15,FALSE)","v":{"$error":"#N/A"}},{"$f":"HLOOKUP($D$44,$O$44:$V$71,15,FALSE)","v":{"$error":"#N/A"}},null,"R-4.2 ci","R-8.3 ci","R-8.3 ci","R-12.5 ci","R-14.6 ci","R-16.7 ci","R-20.0 ci","R-20.0 ci",null,"U-0.137","U-0.087","U-0.087","U-0.064","U-0.057","U-0.051","U-0.043","U-0.043"]
[null,"Steel-Joist",{"$f":"HLOOKUP($C$44,$F$44:$M$71,16,FALSE)","v":{"$error":"#N/A"}},{"$f":"HLOOKUP($D$44,$O$44:$V$71,16,FALSE)","v":{"$error":"#N/A"}},null,"R-19.0","R-30.0","R-30.0","R-38.0","R-38.0","R-38.0 +  R-12.5 ci","R-38.0 +  R-12.5 ci","R-38.0 +  R-12.5 ci",null,"U-0.052","U-0.038","U-0.038","U-0.032","U-0.032","U-0.023","U-0.023","U-0.023"]
[null,"Wood-framed and other",{"$f":"HLOOKUP($C$44,$F$44:$M$71,17,FALSE)","v":{"$error":"#N/A"}},{"$f":"HLOOKUP($D$44,$O$44:$V$71,17,FALSE)","v":{"$error":"#N/A"}},null,"R-19.0","R-30.0 +  R-7.5 ci","R-30.0 +  R-7.5 ci","R-30.0 +  R-7.5 ci","R-30.0 +  R-7.5 ci","R-30.0 +  R-7.5 ci","R-30.0 +  R-7.5 ci","R-30.0 +  R-7.5 ci",null,"U-0.051","U-0.026","U-0.026","U-0.026","U-0.026","U-0.026","U-0.026","U-0.026"]
[null,"Slab Insulation"]
[null,"Unheated (non-radiant) and on-grade",{"$f":"HLOOKUP($C$44,$F$44:$M$71,19,FALSE)","v":{"$error":"#N/A"}},{"$f":"HLOOKUP($D$44,$O$44:$V$71,19,FALSE)","v":{"$error":"#N/A"}},null,"NR","NR","NR","R-15.0 for 24 in. vertical or horizontal","R-15.0 for 24 in. vertical or horizontal","R-20.0 for 24 in. vertical or horizontal","R-15.0 for 24 in. + R-5 ci below","R-15.0 for 24 in. + R-5 ci below",null,"NR","NR","NR","R-15.0 for 24 in. vertical or horizontal","R-15.0 for 24 in. vertical or horizontal","R-20.0 for 24 in. vertical or horizontal","R-15.0 for 24 in. + R-5 ci below","R-15.0 for 24 in. + R-5 ci below"]
[null,"Heated (radiant)",{"$f":"HLOOKUP($C$44,$F$44:$M$71,20,FALSE)","v":{"$error":"#N/A"}},{"$f":"HLOOKUP($D$44,$O$44:$V$71,20,FALSE)","v":{"$error":"#N/A"}},null,"R-7.5 for 12 in. + R-5 ci below","R-7.5 for 12 in. + R-5 ci below","R-7.5 for 12 in. + R-5 ci below","R-10.0 for 24 in. + R-5 ci  below","R-15.0 for 36 in. + R-5 ci below","R-15.0 for 36 in. + R-5 ci below","R-20.0 for 36 in. + R-5 ci below ","R-20.0 for 36 in. + R-5 ci below ",null,"R-7.5 for 12 in. + R-5 ci below","R-7.5 for 12 in. + R-5 ci below","R-7.5 for 12 in. + R-5 ci below","R-10.0 for 24 in. + R-5 ci  below","R-15.0 for 36 in. + R-5 ci below","R-15.0 for 36 in. + R-5 ci below","R-20.0 for 36 in. + R-5 ci below ","R-20.0 for 36 in. + R-5 ci below "]
[null,"Exterior Doors"]
[null,"Opaque - All",{"$f":"HLOOKUP($C$44,$F$44:$M$71,22,FALSE)","v":{"$error":"#N/A"}},{"$f":"HLOOKUP($D$44,$O$44:$V$71,22,FALSE)","v":{"$error":"#N/A"}},null,"-","-","-","-","-","-","-","-",null,"U-0.6","U-0.6","U-0.6","U-0.6","U-0.4","U-0.4","U-0.4","U-0.4"]
[null,"Vertical Glazing"]
[null,"Nonmetal framing",{"$f":"HLOOKUP($C$44,$F$44:$M$71,24,FALSE)","v":{"$error":"#N/A"}},{"$f":"HLOOKUP($D$44,$O$44:$V$71,24,FALSE)","v":{"$error":"#N/A"}},null,"ENERGY STAR","ENERGY STAR","ENERGY STAR","ENERGY STAR","ENERGY STAR","ENERGY STAR","ENERGY STAR","ENERGY STAR",null,"ENERGY STAR","ENERGY STAR","ENERGY STAR","ENERGY STAR","ENERGY STAR","ENERGY STAR","ENERGY STAR","ENERGY STAR"]
[null,null,"Assembly Max U.","Assembly Max. SHGC"]
[null,"Metal framing (curtain wall/ storefront) ",{"$f":"HLOOKUP($C$44,$F$44:$M$71,26,FALSE)","v":{"$error":"#N/A"}},{"$f":"HLOOKUP($D$44,$O$44:$V$71,26,FALSE)","v":{"$error":"#N/A"}},null,"U-1.20","U-0.70","U-0.50","U-0.40","U-0.35","U-0.35","U-0.30","U-0.30",null,"SHGC-0.25","SHGC-0.25","SHGC-0.25","SHGC-0.40","SHGC-0.40","SHGC-0.40","SHGC-NR","SHGC-NR"]
[null,"Metal framing (entrance door)",{"$f":"HLOOKUP($C$44,$F$44:$M$71,27,FALSE)","v":{"$error":"#N/A"}},{"$f":"HLOOKUP($D$44,$O$44:$V$71,27,FALSE)","v":{"$error":"#N/A"}},null,"U-1.20","U-1.10","U-0.80","U-0.75","U-0.70","U-0.70","U-0.70","U-0.70",null,"SHGC-0.25","SHGC-0.25","SHGC-0.25","SHGC-0.40","SHGC-0.40","SHGC-0.40","SHGC-NR","SHGC-NR"]
[null,"Metal framing (all other)",{"$f":"HLOOKUP($C$44,$F$44:$M$71,28,FALSE)","v":{"$error":"#N/A"}},{"$f":"HLOOKUP($D$44,$O$44:$V$71,28,FALSE)","v":{"$error":"#N/A"}},null,"U-1.20","U-0.75","U-0.55","U-0.45","U-0.45","U-0.45","U-0.35","U-0.35",null,"SHGC-0.25","SHGC-0.25","SHGC-0.25","SHGC-0.40","SHGC-0.40","SHGC-0.40","SHGC-NR","SHGC-NR"]
[]
[]
[null,"ASHRAE 90.1 Tables 5.5-1 to 5.5-8 Climate Specific Envelope Requirements for Climate Zones 1-8"]
[null,"Envelope Component","Assembly U-Value (90.1-2007)","Assembly U-Value (90.1-2010)",null,"Assembly U-Value (90.1-2007)",null,null,null,null,null,null,null,null,"Assembly U-Value (90.1-2010)"]
[null,null,{"$f":"IF('Project Info'!C8=\"\",\"<select climate zone on 'Project Info' tab>\",\"Climate Zone \"&'Project Info'!C8)","v":"<select climate zone on 'Project Info' tab>"},{"$f":"IF('Project Info'!C8=\"\",\"<select climate zone on 'Project Info' tab>\",\"Climate Zone \"&'Project Info'!C8)","v":"<select climate zone on 'Project Info' tab>"},1,"Climate Zone 1","Climate Zone 2","Climate Zone 3","Climate Zone 4","Climate Zone 5","Climate Zone 6","Climate Zone 7","Climate Zone 8",null,"Climate Zone 1","Climate Zone 2","Climate Zone 3","Climate Zone 4","Climate Zone 5","Climate Zone 6","Climate Zone 7","Climate Zone 8"]
[null,"Roof Insulation",null,null,2]
[null,"Insulation entirely above deck",{"$f":"HLOOKUP($D$76,$F$76:$M$89,3,FALSE)","v":{"$error":"#N/A"}},{"$f":"HLOOKUP($D$76,$O$76:$V$89,3,FALSE)","v":{"$error":"#N/A"}},3,"Nonresidential: U-0.063, R-15 ci\nResidential: U-0.048, R-20 ci","Nonresidential: U-0.048, R-20 ci\nResidential: U-0.048, R-20 ci","Nonresidential: U-0.048, R-20 ci\nResidential: U-0.048, R-20 ci","Nonresidential: U-0.048, R-20 ci\nResidential: U-0.048, R-20 ci","Nonresidential: U-0.048, R-20 ci\nResidential: U-0.048, R-20 ci","Nonresidential: U-0.048, R-20 ci\nResidential: U-0.048, R-20 ci","Nonresidential: U-0.048, R-20 ci\nResidential: U-0.048, R-20 ci","Nonresidential: U-0.048, R-20 ci\nResidential: U-0.048, R-20 ci",null,"Nonresidential: U-0.048, R-20 ci\nResidential: U-0.039, R-25 ci","Nonresidential: U-0.039, R-25 ci\nResidential: U-0.039, R-25 ci","Nonresidential: U-0.039, R-25 ci\nResidential: U-0.039, R-25 ci","Nonresidential: U-0.032, R-30 ci\nResidential: U-0.032, R-30 ci","Nonresidential: U-0.032, R-30 ci\nResidential: U-0.032, R-30 ci","Nonresidential: U-0.032, R-30 ci\nResidential: U-0.032, R-30 ci","Nonresidential: U-0.028, R-35 ci\nResidential: U-0.028, R-35 ci","Nonresidential: U-0.028, R-35 ci\nResidential: U-0.028, R-35 ci"]
[null,"Above Grade Wall Insulation",null,null,4]
[null,"Steel-Framed",{"$f":"HLOOKUP($D$76,$F$76:$M$89,5,FALSE)","v":{"$error":"#N/A"}},{"$f":"HLOOKUP($D$76,$O$76:$V$89,5,FALSE)","v":{"$error":"#N/A"}},5,"Nonresidential: U-0.124, R-13\nResidential: U-0.124, R-13","Nonresidential: U-0.124, R-13\nResidential: U-0.064, R-13+R-7.5 ci","Nonresidential: U-0.084, R-13+R-3.8 ci\nResidential: U-0.064, R-13+R-7.5 ci","Nonresidential: U-0.064, R-13+R-7.5 ci\nResidential: U-0.064, R-13+R-7.5 ci","Nonresidential: U-0.064, R-13+R-7.5 ci\nResidential: U-0.064, R-13+R-7.5 ci","Nonresidential: U-0.064, R-13+R-7.5 ci\nResidential: U-0.064, R-13+R-7.5 ci","Nonresidential: U-0.064, R-13+R-7.5 ci\nResidential: U-0.042, R-13+R-15.6 ci","Nonresidential: U-0.064, R-13+R-7.5 ci\nResidential: U-0.037, R-13+R-18.8 ci",null,"Nonresidential: U-0.124, R-13\nResidential: U-0.124, R-13","Nonresidential: U-0.084, R-13+R-3.8 ci\nResidential: U-0.064, R-13+R-7.5 ci","Nonresidential: U-0.077, R-13+R-5 ci\nResidential: U-0.064, R-13+R-7.5 ci","Nonresidential: U-0.064, R-13+R-7.5 ci\nResidential: U-0.064, R-13+R-7.5 ci","Nonresidential: U-0.055, R-13+R-10 ci\nResidential: U-0.055, R-13+R-10 ci","Nonresidential: U-0.049, R-13+R-12.5 ci\nResidential: U-0.049, R-13+R-12.5 ci","Nonresidential: U-0.049, R-13+R-12.5 ci\nResidential: U-0.042, R-13+R-15.6 ci","Nonresidential: U-0.037, R-13+R-18.8 ci\nResidential: U-0.037, R-13+R-18.8 ci"]
[null,"Below Grade Wall Insulation",null,null,6]
[null,"Below-Grade Wall",{"$f":"HLOOKUP($D$76,$F$76:$M$89,7,FALSE)","v":{"$error":"#N/A"}},{"$f":"HLOOKUP($D$76,$O$76:$V$89,7,FALSE)","v":{"$error":"#N/A"}},7,"Nonresidential: C-1.140, NR\nResidential: C-1.140, NR","Nonresidential: C-1.140, NR\nResidential: C-1.140, NR","Nonresidential: C-1.140, NR\nResidential: C-1.140, NR","Nonresidential: C-1.140, NR\nResidential: C-0.119, R-7.5 ci","Nonresidential: C-0.119, R-7.5 ci\nResidential: C-0.119, R-7.5 ci","Nonresidential: C-0.119, R-7.5 ci\nResidential: C-0.119, R-7.5 ci","Nonresidential: C-0.119, R-7.5 ci\nResidential: C-0.092, R-10 ci","Nonresidential: C-0.119, R-7.5 ci\nResidential: C-0.075, R-12.5 ci",null,"Nonresidential: C-1.140, NR\nResidential: C-1.140, NR","Nonresidential: C-1.140, NR\nResidential: C-1.140, NR","Nonresidential: C-1.140, NR\nResidential: C-1.140, NR","Nonresidential: C-0.119, R-7.5 ci\nResidential: C-0.092, R-10 ci","Nonresidential: C-0.119, R-7.5 ci\nResidential: C-0.092, R-10 ci","Nonresidential: C-0.092, R-10 ci\nResidential: C-0.063, R-15 ci","Nonresidential: C-0.063, R-15 ci\nResidential: C-0.063, R-15 ci","Nonresidential: C-0.063, R-15 ci\nResidential: C-0.063, R-15 ci"]
[null,"Floor Insulation",null,null,8]
[null,"Steel-Joist",{"$f":"HLOOKUP($D$76,$F$76:$M$89,9,FALSE)","v":{"$error":"#N/A"}},{"$f":"HLOOKUP($D$76,$O$76:$V$89,9,FALSE)","v":{"$error":"#N/A"}},9,"Nonresidential: U-0.350, NR\nResidential: U-0.350, NR","Nonresidential: U-0.052, R-19\nResidential: U-0.052, R-19","Nonresidential: U-0.052, R-19\nResidential: U-0.052, R-19","Nonresidential: U-0.038, R-30\nResidential: U-0.038, R-30","Nonresidential: U-0.038, R-30\nResidential: U-0.038, R-30","Nonresidential: U-0.038, R-30\nResidential: U-0.032, R-38","Nonresidential: U-0.038, R-30\nResidential: U-0.032, R-38","Nonresidential: U-0.032, R-38\nResidential: U-0.032, R-38",null,"Nonresidential: U-0.350, NR\nResidential: U-0.350, NR","Nonresidential: U-0.038, R-30\nResidential: U-0.038, R-30","Nonresidential: U-0.038, R-30\nResidential: U-0.038, R-30","Nonresidential: U-0.038, R-30\nResidential: U-0.038, R-30","Nonresidential: U-0.038, R-30\nResidential: U-0.038, R-30","Nonresidential: U-0.032, R-38\nResidential: U-0.032, R-38","Nonresidential: U-0.032, R-38\nResidential: U-0.032, R-38","Nonresidential: U-0.032, R-38\nResidential: U-0.032, R-38"]
[null,"Slab Insulation",null,null,10]
[null,"Unheated (non-radiant) and on-grade",{"$f":"HLOOKUP($D$76,$F$76:$M$89,11,FALSE)","v":{"$error":"#N/A"}},{"$f":"HLOOKUP($D$76,$O$76:$V$89,11,FALSE)","v":{"$error":"#N/A"}},11,"Nonresidential: NR \nResidential: NR","Nonresidential: NR \nResidential: NR","Nonresidential: NR \nResidential: NR","Nonresidential: NR \nResidential: R-10 for 24 in","Nonresidential: NR \nResidential: R-10 for 24 in","Nonresidential: R-10 for 24 in \nResidential: R-15 for 24 in","Nonresidential: R-15 for 24 in \nResidential: R-15 for 24 in","Nonresidential: R-15 for 24 in \nResidential: R-20 for 24 in",null,"Nonresidential: NR \nResidential: NR","Nonresidential: NR \nResidential: NR","Nonresidential: NR \nResidential: R-10 for 24 in","Nonresidential: R-15 for 24 in \nResidential: R-15 for 24 in","Nonresidential: R-15 for 24 in \nResidential: R-20 for 24 in","Nonresidential: R-20 for 24 in \nResidential: R-20 for 48 in","Nonresidential: R-20 for 24 in \nResidential: R-20 for 48 in","Nonresidential: R-20 for 48 in \nResidential: R-25 for 48 in"]
[null,"Heated (radiant)",{"$f":"HLOOKUP($D$76,$F$76:$M$89,12,FALSE)","v":{"$error":"#N/A"}},{"$f":"HLOOKUP($D$76,$O$76:$V$89,12,FALSE)","v":{"$error":"#N/A"}},12,"Nonresidential: R-7.5 for 12 in\nResidential: R-7.5 for 12 in","Nonresidential: R-7.5 for 12 in\nResidential: R-7.5 for 12 in","Nonresidential: R-10 for 24 in \nResidential: R-10 for 24 in","Nonresidential: R-15 for 24 in \nResidential: R-15 for 24 in","Nonresidential: R-15 for 24 in \nResidential: R-15 for 24 in","Nonresidential: R-15 for 24 in \nResidential: R-20 for 48 in","Nonresidential: R-20 for 24 in \nResidential: R-20 for 48 in","Nonresidential: R-20 for 48 in \nResidential: R-20 for 48 in",null,"Nonresidential: R-7.5 for 12 in\nResidential: R-7.5 for 12 in","Nonresidential: R-10 for 24 in \nResidential: R-15 for 24 in","Nonresidential: R-15 for 24 in \nResidential: R-15 for 24 in","Nonresidential: R-20 for 24 in \nResidential: R-20 for 48 in","Nonresidential: R-20 for 48 in \nResidential: R-20 for 48 in","Nonresidential: R-20 for 48 in \nResidential: R-25 for 48 in","Nonresidential: R-25 for 48 in \nResidential: R-25 for 48 in","Nonresidential: R-25 for 48 in \nResidential: R-20 full slab"]
[null,"Exterior Doors",null,null,13]
[null,"Opaque - All",{"$f":"HLOOKUP($D$76,$F$76:$M$89,14,FALSE)","v":{"$error":"#N/A"}},{"$f":"HLOOKUP($D$76,$O$76:$V$89,14,FALSE)","v":{"$error":"#N/A"}},14,"Nonresidential: U-0.70\nResidential: U-0.70","Nonresidential: U-0.70\nResidential: U-0.70","Nonresidential: U-0.70\nResidential: U-0.70","Nonresidential: U-0.70\nResidential: U-0.70","Nonresidential: U-0.70\nResidential: U-0.50","Nonresidential: U-0.70\nResidential: U-0.50","Nonresidential: U-0.50\nResidential: U-0.50","Nonresidential: U-0.50\nResidential: U-0.50",null,"Nonresidential: U-0.70\nResidential: U-0.50","Nonresidential: U-0.70\nResidential: U-0.50","Nonresidential: U-0.70\nResidential: U-0.50","Nonresidential: U-0.50\nResidential: U-0.50","Nonresidential: U-0.50\nResidential: U-0.50","Nonresidential: U-0.50\nResidential: U-0.50","Nonresidential: U-0.50\nResidential: U-0.50","Nonresidential: U-0.50\nResidential: U-0.50"]

{"sheet":"Overview","index":8,"n_rows":286,"n_cols":13,"rows_kept":286,"cut":false,"hidden":false,"merged":[[5,15,9,18],[11,2,12,2],[11,3,12,3],[11,9,11,11],[11,4,11,8]]}
[null,null,null,"Instructions"]
[null,null,null,"1) This Worksheet serves as an overview of a project's energy efficiency components including modeling assumptions, plan review and inspection comments."]
[null,null,null,"2) The columns on the right serve as a quick visual aid to see which components were not verified, red means not verified."]
[null,null,null,"3) Rows and columns can be hidden and adjusted to condense as much as possible before printing to send to members of the project team."]
[]
[null,null,null,"Project Name: ",null,null,{"$f":"'Project Info'!C3","v":0}]
[null,null,null,"Address: ",null,null,{"$f":"'Project Info'!C5","v":0}]
[null,null,null,"City, State, Zip:",null,null,{"$f":"'Project Info'!C6","v":0}]
[null,null,null,"Climate Zone",null,null,{"$f":"'Project Info'!C7","v":0}]
[null,null,null,null,null,null,{"$f":"'Project Info'!C8","v":0}]
[]
[null,null,"Item #","BUILDING COMPONENT ","# REVIEW:  75% and 100% Design Completion Review\nPrepared by:\nDate:",null,null,null,null,"AS BUILT REVIEW: \nPrepared by:\nDate: "]
[null,null,null,null,"Proposed ERM \n(Method of Compliance \nby Client)","Values Used in Energy Model  ","Plan Review Comments ","Dwg/Spec","Final Design Complies","Inspection Comments ","Dwg/Spec","Final Design Complies","Team Comments"]
[null,null,1,"APPLIANCES - ENERGY STAR"]
[null,null,"1.1.1",{"$f":"'1.1 - APPLIANCES'!D26","v":"Refrigerators"},{"$f":"'1.1 - APPLIANCES'!E26","v":0},{"$f":"'1.1 - APPLIANCES'!F26","v":0},{"$f":"'1.1 - APPLIANCES'!L26","v":0},{"$f":"'1.1 - APPLIANCES'!M26","v":0},{"$f":"'1.1 - APPLIANCES'!N26","v":0},{"$f":"'1.1 - APPLIANCES'!P26","v":0},{"$f":"'1.1 - APPLIANCES'!M26","v":0},{"$f":"'1.1 - APPLIANCES'!O26","v":0}]
[null,null,"1.1.2",{"$f":"'1.1 - APPLIANCES'!D27","v":"Dishwashers"},{"$f":"'1.1 - APPLIANCES'!E27","v":0},{"$f":"'1.1 - APPLIANCES'!F27","v":0},{"$f":"'1.1 - APPLIANCES'!L27","v":0},{"$f":"'1.1 - APPLIANCES'!M27","v":0},{"$f":"'1.1 - APPLIANCES'!N27","v":0},{"$f":"'1.1 - APPLIANCES'!P27","v":0},{"$f":"'1.1 - APPLIANCES'!M27","v":0},{"$f":"'1.1 - APPLIANCES'!O27","v":0}]
[null,null,"1.1.3",{"$f":"'1.1 - APPLIANCES'!D28","v":"Clothes Washers"},{"$f":"'1.1 - APPLIANCES'!E28","v":0},{"$f":"'1.1 - APPLIANCES'!F28","v":0},{"$f":"'1.1 - APPLIANCES'!L28","v":0},{"$f":"'1.1 - APPLIANCES'!M28","v":0},{"$f":"'1.1 - APPLIANCES'!N28","v":0},{"$f":"'1.1 - APPLIANCES'!P28","v":0},{"$f":"'1.1 - APPLIANCES'!M28","v":0},{"$f":"'1.1 - APPLIANCES'!O28","v":0}]
[null,null,"1.1.4",{"$f":"'1.1 - APPLIANCES'!D29","v":"Ceiling fans"},{"$f":"'1.1 - APPLIANCES'!E29","v":0},{"$f":"'1.1 - APPLIANCES'!F29","v":0},{"$f":"'1.1 - APPLIANCES'!L29","v":0},{"$f":"'1.1 - APPLIANCES'!M29","v":0},{"$f":"'1.1 - APPLIANCES'!N29","v":0},{"$f":"'1.1 - APPLIANCES'!P29","v":0},{"$f":"'1.1 - APPLIANCES'!M29","v":0},{"$f":"'1.1 - APPLIANCES'!O29","v":0}]
[null,null,"1.1.6",{"$f":"'1.1 - APPLIANCES'!D30","v":"Vending Machines"},{"$f":"'1.1 - APPLIANCES'!E30","v":0},{"$f":"'1.1 - APPLIANCES'!F30","v":0},{"$f":"'1.1 - APPLIANCES'!L30","v":0},{"$f":"'1.1 - APPLIANCES'!M30","v":0},{"$f":"'1.1 - APPLIANCES'!N30","v":0},{"$f":"'1.1 - APPLIANCES'!P30","v":0},{"$f":"'1.1 - APPLIANCES'!M30","v":0},{"$f":"'1.1 - APPLIANCES'!O30","v":0}]
[null,null,"1.1.7","Stoves",{"$f":"'1.1 - APPLIANCES'!E32","v":"Enter Fuel"},{"$f":"'1.1 - APPLIANCES'!F32","v":0},{"$f":"'1.1 - APPLIANCES'!G32","v":0},{"$f":"'1.1 - APPLIANCES'!M32","v":0},{"$f":"'1.1 - APPLIANCES'!N32","v":0},{"$f":"'1.1 - APPLIANCES'!P32","v":0},{"$f":"'1.1 - APPLIANCES'!M32","v":0},{"$f":"'1.1 - APPLIANCES'!O32","v":0}]
[null,null,"1.1.8","Dryers",{"$f":"'1.1 - APPLIANCES'!E33","v":"Enter Fuel"},{"$f":"'1.1 - APPLIANCES'!F33","v":0},{"$f":"'1.1 - APPLIANCES'!G33","v":0},{"$f":"'1.1 - APPLIANCES'!M33","v":0},{"$f":"'1.1 - APPLIANCES'!N33","v":0},{"$f":"'1.1 - APPLIANCES'!P33","v":0},{"$f":"'1.1 - APPLIANCES'!M33","v":0},{"$f":"'1.1 - APPLIANCES'!O33","v":0}]
[null,null,"1.1.9","Statement of Substantial Completion","NA","NA","NA","NA","NA",{"$f":"'1.1 - APPLIANCES'!P34","v":0},"NA",{"$f":"'1.1 - APPLIANCES'!O34","v":0}]
[null,null,2,"DOMESTIC HOT WATER "]
[null,null,"2.1.1","Compliance Statement",{"$f":"'2.1-2.2 - DOMESTIC HOT WATER'!F46","v":"See below"},{"$f":"'2.1-2.2 - DOMESTIC HOT WATER'!G46","v":"See below"},{"$f":"'2.1-2.2 - DOMESTIC HOT WATER'!H46","v":0},{"$f":"'2.1-2.2 - DOMESTIC HOT WATER'!M46","v":0},{"$f":"'2.1-2.2 - DOMESTIC HOT WATER'!N46","v":0},{"$f":"'2.1-2.2 - DOMESTIC HOT WATER'!P46","v":0},{"$f":"'2.1-2.2 - DOMESTIC HOT WATER'!M46","v":0},{"$f":"'2.1-2.2 - DOMESTIC HOT WATER'!O46","v":0}]
[null,null,null,"MODELING INPUTS"]
[null,null,"2.2.1","DHW - Type & Efficiency",{"$f":"'2.1-2.2 - DOMESTIC HOT WATER'!F48","v":0},{"$f":"'2.1-2.2 - DOMESTIC HOT WATER'!G48","v":0},{"$f":"'2.1-2.2 - DOMESTIC HOT WATER'!H48","v":0},{"$f":"'2.1-2.2 - DOMESTIC HOT WATER'!M48","v":0},{"$f":"'2.1-2.2 - DOMESTIC HOT WATER'!N48","v":0},{"$f":"'2.1-2.2 - DOMESTIC HOT WATER'!P48","v":0},{"$f":"'2.1-2.2 - DOMESTIC HOT WATER'!M48","v":0},{"$f":"'2.1-2.2 - DOMESTIC HOT WATER'!O48","v":0}]
[null,null,"2.2.2","DHW - Storage Insulation",{"$f":"'2.1-2.2 - DOMESTIC HOT WATER'!F49","v":0},{"$f":"'2.1-2.2 - DOMESTIC HOT WATER'!G49","v":0},{"$f":"'2.1-2.2 - DOMESTIC HOT WATER'!H49","v":0},{"$f":"'2.1-2.2 - DOMESTIC HOT WATER'!M49","v":0},{"$f":"'2.1-2.2 - DOMESTIC HOT WATER'!N49","v":0},{"$f":"'2.1-2.2 - DOMESTIC HOT WATER'!P49","v":0},{"$f":"'2.1-2.2 - DOMESTIC HOT WATER'!M49","v":0},{"$f":"'2.1-2.2 - DOMESTIC HOT WATER'!O49","v":0}]
[null,null,"2.2.3","DHW - Low Flow Fixtures",{"$f":"'2.1-2.2 - DOMESTIC HOT WATER'!F50","v":0},{"$f":"'2.1-2.2 - DOMESTIC HOT WATER'!G50","v":0},{"$f":"'2.1-2.2 - DOMESTIC HOT WATER'!H50","v":0},{"$f":"'2.1-2.2 - DOMESTIC HOT WATER'!M50","v":0},{"$f":"'2.1-2.2 - DOMESTIC HOT WATER'!N50","v":0},{"$f":"'2.1-2.2 - DOMESTIC HOT WATER'!P50","v":0},{"$f":"'2.1-2.2 - DOMESTIC HOT WATER'!M50","v":0},{"$f":"'2.1-2.2 - DOMESTIC HOT WATER'!O50","v":0}]
[null,null,null,"DHW CONFIGURATION, CONTROLS, DISTRIBUTION & DOCUMENTATION"]
[null,null,"2.3.1","DHW Central Plant - Boiler room location and venting","NA","NA",{"$f":"'2.1-2.2 - DOMESTIC HOT WATER'!H52","v":0},{"$f":"'2.1-2.2 - DOMESTIC HOT WATER'!M52","v":0},{"$f":"'2.1-2.2 - DOMESTIC HOT WATER'!N52","v":0},{"$f":"'2.1-2.2 - DOMESTIC HOT WATER'!P52","v":0},{"$f":"'2.1-2.2 - DOMESTIC HOT WATER'!M52","v":0},{"$f":"'2.1-2.2 - DOMESTIC HOT WATER'!O52","v":0}]
[null,null,"2.3.2","DHW - Insulation for Piping","NA","NA",{"$f":"'2.1-2.2 - DOMESTIC HOT WATER'!H53","v":0},{"$f":"'2.1-2.2 - DOMESTIC HOT WATER'!M53","v":0},{"$f":"'2.1-2.2 - DOMESTIC HOT WATER'!N53","v":0},{"$f":"'2.1-2.2 - DOMESTIC HOT WATER'!P53","v":0},{"$f":"'2.1-2.2 - DOMESTIC HOT WATER'!M53","v":0},{"$f":"'2.1-2.2 - DOMESTIC HOT WATER'!O53","v":0}]
[null,null,"2.3.3","DHW - Temperature","NA","NA",{"$f":"'2.1-2.2 - DOMESTIC HOT WATER'!H54","v":0},{"$f":"'2.1-2.2 - DOMESTIC HOT WATER'!M54","v":0},{"$f":"'2.1-2.2 - DOMESTIC HOT WATER'!N54","v":0},{"$f":"'2.1-2.2 - DOMESTIC HOT WATER'!P54","v":0},{"$f":"'2.1-2.2 - DOMESTIC HOT WATER'!M54","v":0},{"$f":"'2.1-2.2 - DOMESTIC HOT WATER'!O54","v":0}]
[null,null,"2.3.4","DHW - Controls","NA","NA",{"$f":"'2.1-2.2 - DOMESTIC HOT WATER'!H55","v":0},{"$f":"'2.1-2.2 - DOMESTIC HOT WATER'!M55","v":0},{"$f":"'2.1-2.2 - DOMESTIC HOT WATER'!N55","v":0},{"$f":"'2.1-2.2 - DOMESTIC HOT WATER'!P55","v":0},{"$f":"'2.1-2.2 - DOMESTIC HOT WATER'!M55","v":0},{"$f":"'2.1-2.2 - DOMESTIC HOT WATER'!O55","v":0}]
[null,null,"2.3.5","DHW - Training and Manuals","NA","NA","NA","NA","NA",{"$f":"'2.1-2.2 - DOMESTIC HOT WATER'!P56","v":0},{"$f":"'2.1-2.2 - DOMESTIC HOT WATER'!M56","v":0},{"$f":"'2.1-2.2 - DOMESTIC HOT WATER'!O56","v":0}]
[null,null,"2.3.6","DHW - Manufacturer's Product Data","NA","NA","NA","NA","NA",{"$f":"'2.1-2.2 - DOMESTIC HOT WATER'!P57","v":0},{"$f":"'2.1-2.2 - DOMESTIC HOT WATER'!M57","v":0},{"$f":"'2.1-2.2 - DOMESTIC HOT WATER'!O57","v":0}]
[null,null,3,"ENVELOPE "]
[null,null,null,"BELOW GRADE WALLS"]
[null,null,"3.1.1","Below Grade Walls - Notes for Drawings and Specifications","NA","NA",{"$f":"'3.1 - ENV_BELOW GRADE WALLS'!$F$27","v":0},{"$f":"'3.1 - ENV_BELOW GRADE WALLS'!$G$27","v":0},{"$f":"'3.1 - ENV_BELOW GRADE WALLS'!$H$27","v":0},"NA","NA","NA"]
[null,null,"3.1.2","Overall U-Value for Below Grade Walls",{"$f":"'3.1 - ENV_BELOW GRADE WALLS'!D45","v":0},{"$f":"'3.1 - ENV_BELOW GRADE WALLS'!E45","v":0},{"$f":"'3.1 - ENV_BELOW GRADE WALLS'!F45","v":0},{"$f":"'3.1 - ENV_BELOW GRADE WALLS'!G45","v":0},{"$f":"'3.1 - ENV_BELOW GRADE WALLS'!H45","v":0},{"$f":"'3.1 - ENV_BELOW GRADE WALLS'!J45","v":0},{"$f":"'3.1 - ENV_BELOW GRADE WALLS'!G45","v":0},{"$f":"'3.1 - ENV_BELOW GRADE WALLS'!I45","v":0}]
[null,null,"3.1.3","Below Grade Walls - Compliance Statement","NA","NA",{"$f":"'3.1 - ENV_BELOW GRADE WALLS'!F49","v":0},{"$f":"'3.1 - ENV_BELOW GRADE WALLS'!G49","v":0},{"$f":"'3.1 - ENV_BELOW GRADE WALLS'!H49","v":0},{"$f":"'3.1 - ENV_BELOW GRADE WALLS'!J49","v":0},{"$f":"'3.1 - ENV_BELOW GRADE WALLS'!G49","v":0},{"$f":"'3.1 - ENV_BELOW GRADE WALLS'!I49","v":0}]
[null,null,"3.1.4","Below Grade Walls - Insulation Installation Requirements","NA","NA",{"$f":"'3.1 - ENV_BELOW GRADE WALLS'!F50","v":0},{"$f":"'3.1 - ENV_BELOW GRADE WALLS'!G50","v":0},{"$f":"'3.1 - ENV_BELOW GRADE WALLS'!H50","v":0},{"$f":"'3.1 - ENV_BELOW GRADE WALLS'!J50","v":0},{"$f":"'3.1 - ENV_BELOW GRADE WALLS'!G50","v":0},{"$f":"'3.1 - ENV_BELOW GRADE WALLS'!I50","v":0}]
[null,null,"3.1.5","Below Grade Walls - Wood-Framed Construction","NA","NA",{"$f":"'3.1 - ENV_BELOW GRADE WALLS'!F51","v":0},{"$f":"'3.1 - ENV_BELOW GRADE WALLS'!G51","v":0},{"$f":"'3.1 - ENV_BELOW GRADE WALLS'!H51","v":0},{"$f":"'3.1 - ENV_BELOW GRADE WALLS'!J51","v":0},"NA",{"$f":"'3.1 - ENV_BELOW GRADE WALLS'!I51","v":0}]
[null,null,"3.1.6","Below Grade Walls - Final Inspection","NA","NA","NA","NA","NA",{"$f":"'3.1 - ENV_BELOW GRADE WALLS'!J52","v":0},"NA",{"$f":"'3.1 - ENV_BELOW GRADE WALLS'!I52","v":0}]
[null,null,null,"ABOVE GRADE WALLS"]
[null,null,"3.2.1","Above Grade Walls - Notes for Drawings and Specifications","NA","NA",{"$f":"'3.1 - ENV_ABOVE GRADE WALLS'!$F$26","v":0},{"$f":"'3.1 - ENV_ABOVE GRADE WALLS'!$G$26","v":0},{"$f":"'3.1 - ENV_ABOVE GRADE WALLS'!$H$26","v":0},"NA","NA","NA"]
[null,null,"3.2.2","Overall U-Value for Above Grade Walls",{"$f":"'3.1 - ENV_ABOVE GRADE WALLS'!D61","v":0},{"$f":"'3.1 - ENV_ABOVE GRADE WALLS'!E61","v":0},{"$f":"'3.1 - ENV_ABOVE GRADE WALLS'!F61","v":0},{"$f":"'3.1 - ENV_ABOVE GRADE WALLS'!G61","v":0},{"$f":"'3.1 - ENV_ABOVE GRADE WALLS'!H61","v":0},{"$f":"'3.1 - ENV_ABOVE GRADE WALLS'!J61","v":0},{"$f":"'3.1 - ENV_ABOVE GRADE WALLS'!G61","v":0},{"$f":"'3.1 - ENV_ABOVE GRADE WALLS'!I61","v":0}]
[null,null,"3.2.3","Overall U-Value for Floor Perimeter/Plan Edge",{"$f":"'3.1 - ENV_ABOVE GRADE WALLS'!D63","v":0},{"$f":"'3.1 - ENV_ABOVE GRADE WALLS'!E63","v":0},{"$f":"'3.1 - ENV_ABOVE GRADE WALLS'!F63","v":0},{"$f":"'3.1 - ENV_ABOVE GRADE WALLS'!G63","v":0},{"$f":"'3.1 - ENV_ABOVE GRADE WALLS'!H63","v":0},{"$f":"'3.1 - ENV_ABOVE GRADE WALLS'!J63","v":0},{"$f":"'3.1 - ENV_ABOVE GRADE WALLS'!G63","v":0},{"$f":"'3.1 - ENV_ABOVE GRADE WALLS'!I63","v":0}]
[null,null,"3.2.4","Above Grade Walls - Compliance Statement","NA","NA",{"$f":"'3.1 - ENV_ABOVE GRADE WALLS'!F65","v":0},{"$f":"'3.1 - ENV_ABOVE GRADE WALLS'!G65","v":0},{"$f":"'3.1 - ENV_ABOVE GRADE WALLS'!H65","v":0},{"$f":"'3.1 - ENV_ABOVE GRADE WALLS'!J65","v":0},{"$f":"'3.1 - ENV_ABOVE GRADE WALLS'!G65","v":0},{"$f":"'3.1 - ENV_ABOVE GRADE WALLS'!I65","v":0}]
[null,null,"3.2.5","Above Grade Walls - Insulation Installation Requirements","NA","NA",{"$f":"'3.1 - ENV_ABOVE GRADE WALLS'!F66","v":0},{"$f":"'3.1 - ENV_ABOVE GRADE WALLS'!G66","v":0},{"$f":"'3.1 - ENV_ABOVE GRADE WALLS'!H66","v":0},{"$f":"'3.1 - ENV_ABOVE GRADE WALLS'!J66","v":0},{"$f":"'3.1 - ENV_ABOVE GRADE WALLS'!G66","v":0},{"$f":"'3.1 - ENV_ABOVE GRADE WALLS'!I66","v":0}]
[null,null,"3.2.6","Floor Perimeter/Plank Edge -  Insulation Installation Requirements","NA","NA",{"$f":"'3.1 - ENV_ABOVE GRADE WALLS'!F67","v":0},{"$f":"'3.1 - ENV_ABOVE GRADE WALLS'!G67","v":0},{"$f":"'3.1 - ENV_ABOVE GRADE WALLS'!H67","v":0},{"$f":"'3.1 - ENV_ABOVE GRADE WALLS'!J67","v":0},{"$f":"'3.1 - ENV_ABOVE GRADE WALLS'!G67","v":0},{"$f":"'3.1 - ENV_ABOVE GRADE WALLS'!I67","v":0}]
[null,null,"3.2.7","Above Grade Walls - Continuous Insulation Requirements","NA","NA",{"$f":"'3.1 - ENV_ABOVE GRADE WALLS'!F68","v":0},{"$f":"'3.1 - ENV_ABOVE GRADE WALLS'!G68","v":0},{"$f":"'3.1 - ENV_ABOVE GRADE WALLS'!H68","v":0},{"$f":"'3.1 - ENV_ABOVE GRADE WALLS'!J68","v":0},{"$f":"'3.1 - ENV_ABOVE GRADE WALLS'!G68","v":0},{"$f":"'3.1 - ENV_ABOVE GRADE WALLS'!I68","v":0}]
[null,null,"3.2.8","Above Grade Walls - Wood-Framed Construction","NA","NA",{"$f":"'3.1 - ENV_ABOVE GRADE WALLS'!F69","v":0},{"$f":"'3.1 - ENV_ABOVE GRADE WALLS'!G69","v":0},{"$f":"'3.1 - ENV_ABOVE GRADE WALLS'!H69","v":0},{"$f":"'3.1 - ENV_ABOVE GRADE WALLS'!J69","v":0},"NA",{"$f":"'3.1 - ENV_ABOVE GRADE WALLS'!I69","v":0}]
[null,null,"3.2.9","Above Grade Walls - Final Inspection","NA","NA","NA","NA","NA",{"$f":"'3.1 - ENV_ABOVE GRADE WALLS'!J70","v":0},"NA",{"$f":"'3.1 - ENV_ABOVE GRADE WALLS'!I70","v":0}]
[null,null,null,"ROOF"]
[null,null,"3.3.1","Roof - Notes for Drawings and Specifications","NA","NA",{"$f":"'3.2 - ENV_ROOF'!$F$26","v":0},{"$f":"'3.2 - ENV_ROOF'!$G$26","v":0},{"$f":"'3.2 - ENV_ROOF'!$H$26","v":0},"NA","NA","NA"]
[null,null,"3.3.2","Overall U-Value for Roofs",{"$f":"'3.2 - ENV_ROOF'!D46","v":0},{"$f":"'3.2 - ENV_ROOF'!E46","v":0},{"$f":"'3.2 - ENV_ROOF'!F46","v":0},{"$f":"'3.2 - ENV_ROOF'!G46","v":0},{"$f":"'3.2 - ENV_ROOF'!H46","v":0},{"$f":"'3.2 - ENV_ROOF'!J46","v":0},{"$f":"'3.2 - ENV_ROOF'!G46","v":0},{"$f":"'3.2 - ENV_ROOF'!I46","v":0}]
[null,null,"3.3.3","Roof - Compliance Statement","NA","NA",{"$f":"'3.2 - ENV_ROOF'!F48","v":0},{"$f":"'3.2 - ENV_ROOF'!G48","v":0},{"$f":"'3.2 - ENV_ROOF'!H48","v":0},{"$f":"'3.2 - ENV_ROOF'!J48","v":0},{"$f":"'3.2 - ENV_ROOF'!G48","v":0},{"$f":"'3.2 - ENV_ROOF'!I48","v":0}]
[null,null,"3.3.4","Roof - Insulation Installation Requirements","NA","NA",{"$f":"'3.2 - ENV_ROOF'!F49","v":0},{"$f":"'3.2 - ENV_ROOF'!G49","v":0},{"$f":"'3.2 - ENV_ROOF'!H49","v":0},{"$f":"'3.2 - ENV_ROOF'!J49","v":0},{"$f":"'3.2 - ENV_ROOF'!G49","v":0},{"$f":"'3.2 - ENV_ROOF'!I49","v":0}]
[null,null,"3.3.5","Wood-Framed Construction","NA","NA",{"$f":"'3.2 - ENV_ROOF'!F50","v":0},{"$f":"'3.2 - ENV_ROOF'!G50","v":0},{"$f":"'3.2 - ENV_ROOF'!H50","v":0},{"$f":"'3.2 - ENV_ROOF'!J50","v":0},"NA",{"$f":"'3.2 - ENV_ROOF'!I50","v":0}]
[null,null,"3.3.6","Final Inspection","NA","NA","NA","NA","NA",{"$f":"'3.2 - ENV_ROOF'!J51","v":0},"NA",{"$f":"'3.2 - ENV_ROOF'!I51","v":0}]
[null,null,null,"FLOORS"]
[null,null,"3.4.1","Floor - Notes for Drawings and Specifications","NA","NA",{"$f":"'3.3 - ENV_FLOORS'!$F$24","v":0},{"$f":"'3.3 - ENV_FLOORS'!$G$24","v":0},{"$f":"'3.3 - ENV_FLOORS'!$H$24","v":0},"NA","NA","NA"]
[null,null,"3.4.2","Overall U-Value for Floors Over Conditioned Spaces",{"$f":"'3.3 - ENV_FLOORS'!D34","v":0},{"$f":"'3.3 - ENV_FLOORS'!E34","v":0},{"$f":"'3.3 - ENV_FLOORS'!F34","v":0},{"$f":"'3.3 - ENV_FLOORS'!G34","v":0},{"$f":"'3.3 - ENV_FLOORS'!H34","v":0},{"$f":"'3.3 - ENV_FLOORS'!J34","v":0},{"$f":"'3.3 - ENV_FLOORS'!G34","v":0},{"$f":"'3.3 - ENV_FLOORS'!I34","v":0}]
[null,null,"3.4.3","Overall U-Value for Below Grade Slab Floors",{"$f":"'3.3 - ENV_FLOORS'!D44","v":0},{"$f":"'3.3 - ENV_FLOORS'!E44","v":0},{"$f":"'3.3 - ENV_FLOORS'!F44","v":0},{"$f":"'3.3 - ENV_FLOORS'!G44","v":0},{"$f":"'3.3 - ENV_FLOORS'!H44","v":0},{"$f":"'3.3 - ENV_FLOORS'!J44","v":0},{"$f":"'3.3 - ENV_FLOORS'!G44","v":0},{"$f":"'3.3 - ENV_FLOORS'!I44","v":0}]
[null,null,"3.4.4","Overall U-Value for Slab-On-Grade (unheated only) Floors",{"$f":"'3.3 - ENV_FLOORS'!D54","v":0},{"$f":"'3.3 - ENV_FLOORS'!E54","v":0},{"$f":"'3.3 - ENV_FLOORS'!F54","v":0},{"$f":"'3.3 - ENV_FLOORS'!G54","v":0},{"$f":"'3.3 - ENV_FLOORS'!H54","v":0},{"$f":"'3.3 - ENV_FLOORS'!J54","v":0},{"$f":"'3.3 - ENV_FLOORS'!G54","v":0},{"$f":"'3.3 - ENV_FLOORS'!I54","v":0}]
[null,null,"3.4.5","Overall U-Value for Slab-On-Grade (embedded only) Floors",{"$f":"'3.3 - ENV_FLOORS'!D64","v":0},{"$f":"'3.3 - ENV_FLOORS'!E64","v":0},{"$f":"'3.3 - ENV_FLOORS'!F64","v":0},{"$f":"'3.3 - ENV_FLOORS'!G64","v":0},{"$f":"'3.3 - ENV_FLOORS'!H64","v":0},{"$f":"'3.3 - ENV_FLOORS'!J64","v":0},{"$f":"'3.3 - ENV_FLOORS'!G64","v":0},{"$f":"'3.3 - ENV_FLOORS'!I64","v":0}]
[null,null,"3.4.6","Floors - Compliance Statement","NA","NA",{"$f":"'3.3 - ENV_FLOORS'!F67","v":0},{"$f":"'3.3 - ENV_FLOORS'!G67","v":0},{"$f":"'3.3 - ENV_FLOORS'!H67","v":0},{"$f":"'3.3 - ENV_FLOORS'!J67","v":0},{"$f":"'3.3 - ENV_FLOORS'!G67","v":0},{"$f":"'3.3 - ENV_FLOORS'!I67","v":0}]
[null,null,"3.4.7","Floor Insulation Above Unconditioned Space -  Insulation Installation Requirements","NA","NA",{"$f":"'3.3 - ENV_FLOORS'!F68","v":0},{"$f":"'3.3 - ENV_FLOORS'!G68","v":0},{"$f":"'3.3 - ENV_FLOORS'!H68","v":0},{"$f":"'3.3 - ENV_FLOORS'!J68","v":0},{"$f":"'3.3 - ENV_FLOORS'!G68","v":0},{"$f":"'3.3 - ENV_FLOORS'!I68","v":0}]
[null,null,"3.4.8","Below Grade Slab Floor- Insulation Installation Requirements","NA","NA",{"$f":"'3.3 - ENV_FLOORS'!F69","v":0},{"$f":"'3.3 - ENV_FLOORS'!G69","v":0},{"$f":"'3.3 - ENV_FLOORS'!H69","v":0},{"$f":"'3.3 - ENV_FLOORS'!J69","v":0},{"$f":"'3.3 - ENV_FLOORS'!G69","v":0},{"$f":"'3.3 - ENV_FLOORS'!I69","v":0}]
[null,null,"3.4.9","Slab-on-Grade (unheated) - Insulation Installation Requirements","NA","NA",{"$f":"'3.3 - ENV_FLOORS'!F70","v":0},{"$f":"'3.3 - ENV_FLOORS'!G70","v":0},{"$f":"'3.3 - ENV_FLOORS'!H70","v":0},{"$f":"'3.3 - ENV_FLOORS'!J70","v":0},{"$f":"'3.3 - ENV_FLOORS'!G70","v":0},{"$f":"'3.3 - ENV_FLOORS'!I70","v":0}]
[null,null,"3.4.10","Slab-on-Grade (embedded heated only) - Insulation Installation Requirements","NA","NA",{"$f":"'3.3 - ENV_FLOORS'!F71","v":0},{"$f":"'3.3 - ENV_FLOORS'!G71","v":0},{"$f":"'3.3 - ENV_FLOORS'!H71","v":0},{"$f":"'3.3 - ENV_FLOORS'!J71","v":0},{"$f":"'3.3 - ENV_FLOORS'!G71","v":0},{"$f":"'3.3 - ENV_FLOORS'!I71","v":0}]
[null,null,"3.4.11","Wood-Framed Construction","NA","NA",{"$f":"'3.3 - ENV_FLOORS'!F72","v":0},{"$f":"'3.3 - ENV_FLOORS'!G72","v":0},{"$f":"'3.3 - ENV_FLOORS'!H72","v":0},{"$f":"'3.3 - ENV_FLOORS'!J72","v":0},"NA",{"$f":"'3.3 - ENV_FLOORS'!I72","v":0}]
[null,null,"3.4.12","Final Inspection","NA","NA","NA","NA","NA",{"$f":"'3.3 - ENV_FLOORS'!J73","v":0},"NA",{"$f":"'3.3 - ENV_FLOORS'!I73","v":0}]
[null,null,null,"WINDOWS"]
[null,null,"3.5.1","Windows - Notes for Drawings and Specifications","NA","NA",{"$f":"'3.4 - ENV_WINDOWS'!$G$27","v":0},{"$f":"'3.4 - ENV_WINDOWS'!$M$27","v":0},{"$f":"'3.4 - ENV_WINDOWS'!$N$27","v":0},"NA","NA","NA"]
[null,null,"3.5.2","Windows - Compliance Statement",{"$f":"'3.4 - ENV_WINDOWS'!E39","v":0},{"$f":"'3.4 - ENV_WINDOWS'!F39","v":0},{"$f":"'3.4 - ENV_WINDOWS'!G39","v":0},{"$f":"'3.4 - ENV_WINDOWS'!M39","v":0},{"$f":"'3.4 - ENV_WINDOWS'!N39","v":0},{"$f":"'3.4 - ENV_WINDOWS'!P39","v":0},{"$f":"'3.4 - ENV_WINDOWS'!M39","v":0},{"$f":"'3.4 - ENV_WINDOWS'!O39","v":0}]
[null,null,"3.5.3","Window-to-Wall Ratio","NA","NA",{"$f":"'3.4 - ENV_WINDOWS'!G40","v":0},{"$f":"'3.4 - ENV_WINDOWS'!M40","v":0},{"$f":"'3.4 - ENV_WINDOWS'!N40","v":0},{"$f":"'3.4 - ENV_WINDOWS'!P40","v":0},{"$f":"'3.4 - ENV_WINDOWS'!M40","v":0},{"$f":"'3.4 - ENV_WINDOWS'!O40","v":0}]
[null,null,"3.5.4","Rough Openings","NA","NA","NA","NA","NA",{"$f":"'3.4 - ENV_WINDOWS'!P41","v":0},"NA",{"$f":"'3.4 - ENV_WINDOWS'!O41","v":0}]
[null,null,"3.5.5","Window/Wall Mock Up","NA","NA","NA","NA","NA",{"$f":"'3.4 - ENV_WINDOWS'!P42","v":0},"NA",{"$f":"'3.4 - ENV_WINDOWS'!O42","v":0}]
[null,null,"3.5.6","On-Going Site Inspections","NA","NA","NA","NA","NA",{"$f":"'3.4 - ENV_WINDOWS'!P43","v":0},"NA",{"$f":"'3.4 - ENV_WINDOWS'!O43","v":0}]
[null,null,"3.5.7","Air Tightness","NA","NA","NA","NA","NA",{"$f":"'3.4 - ENV_WINDOWS'!P44","v":0},"NA",{"$f":"'3.4 - ENV_WINDOWS'!O44","v":0}]
[null,null,"3.5.8","Windows - Manufacturer's Product Data","NA","NA","NA","NA","NA",{"$f":"'3.4 - ENV_WINDOWS'!P45","v":0},"NA",{"$f":"'3.4 - ENV_WINDOWS'!O45","v":0}]
[null,null,"3.5.9","Statement of Substantial Completion","NA","NA","NA","NA","NA",{"$f":"'3.4 - ENV_WINDOWS'!P46","v":0},"NA",{"$f":"'3.4 - ENV_WINDOWS'!O46","v":0}]
[null,null,null,"DOORS"]
[null,null,"3.6.1","Doors - Notes for Drawings and Specifications","NA","NA",{"$f":"'3.5 - ENV_EXTERIOR DOORS'!$G$26","v":0},{"$f":"'3.5 - ENV_EXTERIOR DOORS'!$J$26","v":0},{"$f":"'3.5 - ENV_EXTERIOR DOORS'!$K$26","v":0},"NA","NA","NA"]
[null,null,"3.6.2","Exterior Doors - Compliance Statement",{"$f":"'3.5 - ENV_EXTERIOR DOORS'!E37","v":0},{"$f":"'3.5 - ENV_EXTERIOR DOORS'!F37","v":0},{"$f":"'3.5 - ENV_EXTERIOR DOORS'!G37","v":0},{"$f":"'3.5 - ENV_EXTERIOR DOORS'!J37","v":0},{"$f":"'3.5 - ENV_EXTERIOR DOORS'!K37","v":0},{"$f":"'3.5 - ENV_EXTERIOR DOORS'!M37","v":0},{"$f":"'3.5 - ENV_EXTERIOR DOORS'!J37","v":0},{"$f":"'3.5 - ENV_EXTERIOR DOORS'!L37","v":0}]
[null,null,"3.6.3","Vestibules and Entryways","NA","NA",{"$f":"'3.5 - ENV_EXTERIOR DOORS'!G38","v":0},{"$f":"'3.5 - ENV_EXTERIOR DOORS'!J38","v":0},{"$f":"'3.5 - ENV_EXTERIOR DOORS'!K38","v":0},{"$f":"'3.5 - ENV_EXTERIOR DOORS'!M38","v":0},"NA",{"$f":"'3.5 - ENV_EXTERIOR DOORS'!L38","v":0}]
[null,null,"3.6.4","Operation and Fit","NA","NA","NA","NA","NA",{"$f":"'3.5 - ENV_EXTERIOR DOORS'!M39","v":0},"NA",{"$f":"'3.5 - ENV_EXTERIOR DOORS'!L39","v":0}]
[null,null,"3.6.5","Weather-Stripping","NA","NA","NA","NA","NA",{"$f":"'3.5 - ENV_EXTERIOR DOORS'!M40","v":0},"NA",{"$f":"'3.5 - ENV_EXTERIOR DOORS'!L40","v":0}]
[null,null,"3.6.6","Smoke Testing","NA","NA","NA","NA","NA",{"$f":"'3.5 - ENV_EXTERIOR DOORS'!M41","v":0},"NA",{"$f":"'3.5 - ENV_EXTERIOR DOORS'!L41","v":0}]
[null,null,"3.6.7","Statement of Substantial Completion","NA","NA","NA","NA","NA",{"$f":"'3.5 - ENV_EXTERIOR DOORS'!M42","v":0},"NA",{"$f":"'3.5 - ENV_EXTERIOR DOORS'!L42","v":0}]
[null,null,4,"GARAGES "]
[null,null,"4.1.1","Garage Heating and Compartmentalization - Notes for Drawings and Specifications","NA","NA",{"$f":"'4.1 - GARAGES_CMPTZ & HEATING '!$F$21","v":0},{"$f":"'4.1 - GARAGES_CMPTZ & HEATING '!$G$21","v":0},{"$f":"'4.1 - GARAGES_CMPTZ & HEATING '!$H$21","v":0},"NA","NA","NA"]
[null,null,"4.1.2","Garage Heating","NA","NA",{"$f":"'4.1 - GARAGES_CMPTZ & HEATING '!F23","v":0},{"$f":"'4.1 - GARAGES_CMPTZ & HEATING '!G23","v":0},{"$f":"'4.1 - GARAGES_CMPTZ & HEATING '!H23","v":0},{"$f":"'4.1 - GARAGES_CMPTZ & HEATING '!J23","v":0},{"$f":"'4.1 - GARAGES_CMPTZ & HEATING '!G23","v":0},{"$f":"'4.1 - GARAGES_CMPTZ & HEATING '!I23","v":0}]
[null,null,"4.1.2","Garage Freeze Protection","NA","NA",{"$f":"'4.1 - GARAGES_CMPTZ & HEATING '!F24","v":0},{"$f":"'4.1 - GARAGES_CMPTZ & HEATING '!G24","v":0},{"$f":"'4.1 - GARAGES_CMPTZ & HEATING '!H24","v":0},{"$f":"'4.1 - GARAGES_CMPTZ & HEATING '!J24","v":0},{"$f":"'4.1 - GARAGES_CMPTZ & HEATING '!G24","v":0},{"$f":"'4.1 - GARAGES_CMPTZ & HEATING '!I24","v":0}]
[null,null,"4.1.3","Garage Compartmentalization","NA","NA",{"$f":"'4.1 - GARAGES_CMPTZ & HEATING '!F25","v":0},{"$f":"'4.1 - GARAGES_CMPTZ & HEATING '!G25","v":0},{"$f":"'4.1 - GARAGES_CMPTZ & HEATING '!H25","v":0},{"$f":"'4.1 - GARAGES_CMPTZ & HEATING '!J25","v":0},{"$f":"'4.1 - GARAGES_CMPTZ & HEATING '!G25","v":0},{"$f":"'4.1 - GARAGES_CMPTZ & HEATING '!I25","v":0}]
[null,null,"4.1.4","Wood-Framed Construction","NA","NA","NA","NA","NA",{"$f":"'4.1 - GARAGES_CMPTZ & HEATING '!J26","v":0},"NA",{"$f":"'4.1 - GARAGES_CMPTZ & HEATING '!I26","v":0}]
[null,null,"4.1.5","Doors Between Garage and Building","NA","NA","NA","NA","NA",{"$f":"'4.1 - GARAGES_CMPTZ & HEATING '!J27","v":0},"NA",{"$f":"'4.1 - GARAGES_CMPTZ & HEATING '!I27","v":0}]
[null,null,5,"HEATING"]
[null,null,"5.1.1","Compliance Statement",{"$f":"'5.1, 5.3 - HEATING'!F44","v":"See below"},{"$f":"'5.1, 5.3 - HEATING'!G44","v":"See below"},{"$f":"'5.1, 5.3 - HEATING'!H44","v":0},{"$f":"'5.1, 5.3 - HEATING'!M44","v":0},{"$f":"'5.1, 5.3 - HEATING'!N44","v":0},{"$f":"'5.1, 5.3 - HEATING'!P44","v":0},{"$f":"'5.1, 5.3 - HEATING'!M44","v":0},{"$f":"'5.1, 5.3 - HEATING'!O44","v":0}]
[null,null,null,"MODELING INPUTS"]
[null,null,"5.1.2","Space Heating - Sizing",{"$f":"'5.1, 5.3 - HEATING'!F48","v":0},{"$f":"'5.1, 5.3 - HEATING'!G48","v":0},{"$f":"'5.1, 5.3 - HEATING'!H48","v":0},{"$f":"'5.1, 5.3 - HEATING'!M48","v":0},{"$f":"'5.1, 5.3 - HEATING'!N48","v":0},{"$f":"'5.1, 5.3 - HEATING'!P48","v":0},{"$f":"'5.1, 5.3 - HEATING'!M48","v":0},{"$f":"'5.1, 5.3 - HEATING'!O48","v":0}]
[null,null,"5.1.3","Space Heating - Type & Efficiency",{"$f":"'5.1, 5.3 - HEATING'!F46","v":0},{"$f":"'5.1, 5.3 - HEATING'!G46","v":0},{"$f":"'5.1, 5.3 - HEATING'!H46","v":0},{"$f":"'5.1, 5.3 - HEATING'!M46","v":0},{"$f":"'5.1, 5.3 - HEATING'!N46","v":0},{"$f":"'5.1, 5.3 - HEATING'!P46","v":0},{"$f":"'5.1, 5.3 - HEATING'!M46","v":0},{"$f":"'5.1, 5.3 - HEATING'!O46","v":0}]
[null,null,"5.1.4","Heating Terminal Units - Electric Resistance or Freeze Protection",{"$f":"'5.1, 5.3 - HEATING'!F47","v":0},{"$f":"'5.1, 5.3 - HEATING'!G47","v":0},{"$f":"'5.1, 5.3 - HEATING'!H47","v":0},{"$f":"'5.1, 5.3 - HEATING'!M47","v":0},{"$f":"'5.1, 5.3 - HEATING'!N47","v":0},{"$f":"'5.1, 5.3 - HEATING'!P47","v":0},{"$f":"'5.1, 5.3 - HEATING'!M47","v":0},{"$f":"'5.1, 5.3 - HEATING'!O47","v":0}]
[null,null,"5.1.5","Space Heating Distribution - Fan Power",{"$f":"'5.1, 5.3 - HEATING'!F49","v":0},{"$f":"'5.1, 5.3 - HEATING'!G49","v":0},{"$f":"'5.1, 5.3 - HEATING'!H49","v":0},{"$f":"'5.1, 5.3 - HEATING'!M49","v":0},{"$f":"'5.1, 5.3 - HEATING'!N49","v":0},{"$f":"'5.1, 5.3 - HEATING'!P49","v":0},{"$f":"'5.1, 5.3 - HEATING'!M49","v":0},{"$f":"'5.1, 5.3 - HEATING'!O49","v":0}]
[null,null,"5.1.6","Space Heating - Design Temperatures",{"$f":"'5.1, 5.3 - HEATING'!F50","v":0},{"$f":"'5.1, 5.3 - HEATING'!G50","v":0},{"$f":"'5.1, 5.3 - HEATING'!H50","v":0},{"$f":"'5.1, 5.3 - HEATING'!M50","v":0},{"$f":"'5.1, 5.3 - HEATING'!N50","v":0},{"$f":"'5.1, 5.3 - HEATING'!P50","v":0},{"$f":"'5.1, 5.3 - HEATING'!M50","v":0},{"$f":"'5.1, 5.3 - HEATING'!O50","v":0}]
[null,null,"5.1.7","Space Heating - Controls",{"$f":"'5.1, 5.3 - HEATING'!F51","v":0},{"$f":"'5.1, 5.3 - HEATING'!G51","v":0},{"$f":"'5.1, 5.3 - HEATING'!H51","v":0},{"$f":"'5.1, 5.3 - HEATING'!M51","v":0},{"$f":"'5.1, 5.3 - HEATING'!N51","v":0},{"$f":"'5.1, 5.3 - HEATING'!P51","v":0},{"$f":"'5.1, 5.3 - HEATING'!M51","v":0},{"$f":"'5.1, 5.3 - HEATING'!O51","v":0}]
[null,null,null,"BOILER CONFIGURATION AND HYDRONIC DISTRIBUTION"]
[null,null,"5.2.1","Space Heating Central Plant - Boiler room location and venting","NA","NA",{"$f":"'5.1, 5.3 - HEATING'!H53","v":0},{"$f":"'5.1, 5.3 - HEATING'!M53","v":0},{"$f":"'5.1, 5.3 - HEATING'!N53","v":0},{"$f":"'5.1, 5.3 - HEATING'!P53","v":0},{"$f":"'5.1, 5.3 - HEATING'!M53","v":0},{"$f":"'5.1, 5.3 - HEATING'!O53","v":0}]
[null,null,"5.2.2","Space Heating - Insulation for Piping","NA","NA",{"$f":"'5.1, 5.3 - HEATING'!H54","v":0},{"$f":"'5.1, 5.3 - HEATING'!M54","v":0},{"$f":"'5.1, 5.3 - HEATING'!N54","v":0},{"$f":"'5.1, 5.3 - HEATING'!P54","v":0},{"$f":"'5.1, 5.3 - HEATING'!M54","v":0},{"$f":"'5.1, 5.3 - HEATING'!O54","v":0}]
[null,null,"5.2.3","Heating Distribution - Piping Configuration","NA","NA",{"$f":"'5.1, 5.3 - HEATING'!H55","v":0},{"$f":"'5.1, 5.3 - HEATING'!M55","v":0},{"$f":"'5.1, 5.3 - HEATING'!N55","v":0},{"$f":"'5.1, 5.3 - HEATING'!P55","v":0},{"$f":"'5.1, 5.3 - HEATING'!M55","v":0},{"$f":"'5.1, 5.3 - HEATING'!O55","v":0}]
[null,null,"5.2.4","Heating Distribution - Pump Sizing","NA","NA",{"$f":"'5.1, 5.3 - HEATING'!H56","v":0},{"$f":"'5.1, 5.3 - HEATING'!M56","v":0},{"$f":"'5.1, 5.3 - HEATING'!N56","v":0},{"$f":"'5.1, 5.3 - HEATING'!P56","v":0},{"$f":"'5.1, 5.3 - HEATING'!M56","v":0},{"$f":"'5.1, 5.3 - HEATING'!O56","v":0}]
[null,null,"5.2.5","Heating Distribution - Pressure Control Set-points","NA","NA",{"$f":"'5.1, 5.3 - HEATING'!H57","v":0},{"$f":"'5.1, 5.3 - HEATING'!M57","v":0},{"$f":"'5.1, 5.3 - HEATING'!N57","v":0},{"$f":"'5.1, 5.3 - HEATING'!P57","v":0},{"$f":"'5.1, 5.3 - HEATING'!M57","v":0},{"$f":"'5.1, 5.3 - HEATING'!O57","v":0}]
[null,null,"5.2.6","Heating Terminal Units - Thermostatic Controls","NA","NA",{"$f":"'5.1, 5.3 - HEATING'!H58","v":0},{"$f":"'5.1, 5.3 - HEATING'!M58","v":0},{"$f":"'5.1, 5.3 - HEATING'!N58","v":0},{"$f":"'5.1, 5.3 - HEATING'!P58","v":0},{"$f":"'5.1, 5.3 - HEATING'!M58","v":0},{"$f":"'5.1, 5.3 - HEATING'!O58","v":0}]
[null,null,null,"ALL FORCED AIR HEATING SYSTEMS (Including Heat Pumps where applicable)"]
[null,null,"5.3.1","Heating Distribution - Outdoor Air Damper","NA","NA",{"$f":"'5.1, 5.3 - HEATING'!H60","v":0},{"$f":"'5.1, 5.3 - HEATING'!M60","v":0},{"$f":"'5.1, 5.3 - HEATING'!N60","v":0},{"$f":"'5.1, 5.3 - HEATING'!P60","v":0},{"$f":"'5.1, 5.3 - HEATING'!M60","v":0},{"$f":"'5.1, 5.3 - HEATING'!O60","v":0}]
[null,null,"5.3.2","Heating Distribution - Flex Duct Installation","NA","NA",{"$f":"'5.1, 5.3 - HEATING'!H61","v":0},{"$f":"'5.1, 5.3 - HEATING'!M61","v":0},{"$f":"'5.1, 5.3 - HEATING'!N61","v":0},{"$f":"'5.1, 5.3 - HEATING'!P61","v":0},{"$f":"'5.1, 5.3 - HEATING'!M61","v":0},{"$f":"'5.1, 5.3 - HEATING'!O61","v":0}]
[null,null,"5.3.3","Heating Distribution - Duct Insulation","NA","NA",{"$f":"'5.1, 5.3 - HEATING'!H62","v":0},{"$f":"'5.1, 5.3 - HEATING'!M62","v":0},{"$f":"'5.1, 5.3 - HEATING'!N62","v":0},{"$f":"'5.1, 5.3 - HEATING'!P62","v":0},{"$f":"'5.1, 5.3 - HEATING'!M62","v":0},{"$f":"'5.1, 5.3 - HEATING'!O62","v":0}]
[null,null,"5.3.4","Heating Distribution - Duct Sealing Details","NA","NA",{"$f":"'5.1, 5.3 - HEATING'!H63","v":0},{"$f":"'5.1, 5.3 - HEATING'!M63","v":0},{"$f":"'5.1, 5.3 - HEATING'!N63","v":0},{"$f":"'5.1, 5.3 - HEATING'!P63","v":0},{"$f":"'5.1, 5.3 - HEATING'!M63","v":0},{"$f":"'5.1, 5.3 - HEATING'!O63","v":0}]
[null,null,"5.3.5","Heating System - Combustion Venting","NA","NA","NA","NA","NA",{"$f":"'5.1, 5.3 - HEATING'!P64","v":0},{"$f":"'5.1, 5.3 - HEATING'!M64","v":0},{"$f":"'5.1, 5.3 - HEATING'!O64","v":0}]
[null,null,"5.3.6","Heating System - Refrigerant Charge, Airflow and Nameplate Data","NA","NA","NA","NA","NA",{"$f":"'5.1, 5.3 - HEATING'!P65","v":0},{"$f":"'5.1, 5.3 - HEATING'!M65","v":0},{"$f":"'5.1, 5.3 - HEATING'!O65","v":0}]
[null,null,null,"IN-UNIT FORCED AIR HEATING SYSTEMS"]
[null,null,"5.4.1","Heating Distribution - In-Unit Duct Sizing","NA","NA",{"$f":"'5.1, 5.3 - HEATING'!H67","v":0},{"$f":"'5.1, 5.3 - HEATING'!M67","v":0},{"$f":"'5.1, 5.3 - HEATING'!N67","v":0},{"$f":"'5.1, 5.3 - HEATING'!P67","v":0},{"$f":"'5.1, 5.3 - HEATING'!M67","v":0},{"$f":"'5.1, 5.3 - HEATING'!O67","v":0}]
[null,null,"5.4.2","Heating Distribution - In-Unit Pressure Balancing","NA","NA",{"$f":"'5.1, 5.3 - HEATING'!H68","v":0},{"$f":"'5.1, 5.3 - HEATING'!M68","v":0},{"$f":"'5.1, 5.3 - HEATING'!N68","v":0},{"$f":"'5.1, 5.3 - HEATING'!P68","v":0},{"$f":"'5.1, 5.3 - HEATING'!M68","v":0},{"$f":"'5.1, 5.3 - HEATING'!O68","v":0}]
[null,null,"5.4.3","Heating Distribution - In-Unit Duct Leakage Testing","NA","NA",{"$f":"'5.1, 5.3 - HEATING'!H69","v":0},{"$f":"'5.1, 5.3 - HEATING'!M69","v":0},{"$f":"'5.1, 5.3 - HEATING'!N69","v":0},{"$f":"'5.1, 5.3 - HEATING'!P69","v":0},{"$f":"'5.1, 5.3 - HEATING'!M69","v":0},{"$f":"'5.1, 5.3 - HEATING'!O69","v":0}]
[null,null,"5.4.4","Heating Distribution - HVAC Contractor Checklist","NA","NA",{"$f":"'5.1, 5.3 - HEATING'!H70","v":0},{"$f":"'5.1, 5.3 - HEATING'!M70","v":0},{"$f":"'5.1, 5.3 - HEATING'!N70","v":0},{"$f":"'5.1, 5.3 - HEATING'!P70","v":0},{"$f":"'5.1, 5.3 - HEATING'!M70","v":0},{"$f":"'5.1, 5.3 - HEATING'!O70","v":0}]
[null,null,null,"HEATING SYSTEMS MISC"]
[null,null,"5.5.1","Heating Distribution - Thermostat","NA","NA",{"$f":"'5.1, 5.3 - HEATING'!H72","v":0},{"$f":"'5.1, 5.3 - HEATING'!M72","v":0},{"$f":"'5.1, 5.3 - HEATING'!N72","v":0},{"$f":"'5.1, 5.3 - HEATING'!P72","v":0},{"$f":"'5.1, 5.3 - HEATING'!M72","v":0},{"$f":"'5.1, 5.3 - HEATING'!O72","v":0}]
[null,null,"5.5.2","Space Heating - Training and Manuals","NA","NA","NA","NA","NA",{"$f":"'5.1, 5.3 - HEATING'!P73","v":0},{"$f":"'5.1, 5.3 - HEATING'!M73","v":0},{"$f":"'5.1, 5.3 - HEATING'!O73","v":0}]
[null,null,"5.5.3","Space Heating - Manufacturer's Product Data","NA","NA","NA","NA","NA",{"$f":"'5.1, 5.3 - HEATING'!P74","v":0},{"$f":"'5.1, 5.3 - HEATING'!M74","v":0},{"$f":"'5.1, 5.3 - HEATING'!O74","v":0}]
[null,null,5.6,"COOLING"]
[null,null,"5.6.1","Compliance Statement",{"$f":"'5.2, 5.4 - COOLING'!E33","v":"see below"},{"$f":"'5.2, 5.4 - COOLING'!F33","v":"see below"},{"$f":"'5.2, 5.4 - COOLING'!G33","v":0},{"$f":"'5.2, 5.4 - COOLING'!N33","v":0},{"$f":"'5.2, 5.4 - COOLING'!O33","v":0},{"$f":"'5.2, 5.4 - COOLING'!Q33","v":0},{"$f":"'5.2, 5.4 - COOLING'!N33","v":0},{"$f":"'5.2, 5.4 - COOLING'!P33","v":0}]
[null,null,null,"MODELING INPUTS"]
[null,null,"5.6.2","Space Cooling  - Sizing",{"$f":"'5.2, 5.4 - COOLING'!E36","v":0},{"$f":"'5.2, 5.4 - COOLING'!F36","v":0},{"$f":"'5.2, 5.4 - COOLING'!G36","v":0},{"$f":"'5.2, 5.4 - COOLING'!N36","v":0},{"$f":"'5.2, 5.4 - COOLING'!O36","v":0},{"$f":"'5.2, 5.4 - COOLING'!Q36","v":0},{"$f":"'5.2, 5.4 - COOLING'!N36","v":0},{"$f":"'5.2, 5.4 - COOLING'!P36","v":0}]
[null,null,"5.6.3","Space Cooling  - Type and Efficiency",{"$f":"'5.2, 5.4 - COOLING'!E35","v":0},{"$f":"'5.2, 5.4 - COOLING'!F35","v":0},{"$f":"'5.2, 5.4 - COOLING'!G35","v":0},{"$f":"'5.2, 5.4 - COOLING'!N35","v":0},{"$f":"'5.2, 5.4 - COOLING'!O35","v":0},{"$f":"'5.2, 5.4 - COOLING'!Q35","v":0},{"$f":"'5.2, 5.4 - COOLING'!N35","v":0},{"$f":"'5.2, 5.4 - COOLING'!P35","v":0}]
[null,null,"5.6.4","Space Cooling  Distribution - Supply Fan Power",{"$f":"'5.2, 5.4 - COOLING'!E37","v":0},{"$f":"'5.2, 5.4 - COOLING'!F37","v":0},{"$f":"'5.2, 5.4 - COOLING'!G37","v":0},{"$f":"'5.2, 5.4 - COOLING'!N37","v":0},{"$f":"'5.2, 5.4 - COOLING'!O37","v":0},{"$f":"'5.2, 5.4 - COOLING'!Q37","v":0},{"$f":"'5.2, 5.4 - COOLING'!N37","v":0},{"$f":"'5.2, 5.4 - COOLING'!P37","v":0}]
[null,null,"5.6.5","Space Cooling  - Controls",{"$f":"'5.2, 5.4 - COOLING'!E38","v":0},{"$f":"'5.2, 5.4 - COOLING'!F38","v":0},{"$f":"'5.2, 5.4 - COOLING'!G38","v":0},{"$f":"'5.2, 5.4 - COOLING'!N38","v":0},{"$f":"'5.2, 5.4 - COOLING'!O38","v":0},{"$f":"'5.2, 5.4 - COOLING'!Q38","v":0},{"$f":"'5.2, 5.4 - COOLING'!N38","v":0},{"$f":"'5.2, 5.4 - COOLING'!P38","v":0}]
[null,null,null,"CHILLED WATER AND CONDENSER WATER SYSTEMS"]
[null,null,"5.7.1","Cooling Distribution - Piping Configuration","NA","NA",{"$f":"'5.2, 5.4 - COOLING'!G40","v":0},{"$f":"'5.2, 5.4 - COOLING'!N40","v":0},{"$f":"'5.2, 5.4 - COOLING'!O40","v":0},{"$f":"'5.2, 5.4 - COOLING'!Q40","v":0},{"$f":"'5.2, 5.4 - COOLING'!N40","v":0},{"$f":"'5.2, 5.4 - COOLING'!P40","v":0}]
[null,null,"5.7.2","Cooling Distribution - Pump Sizing","NA","NA",{"$f":"'5.2, 5.4 - COOLING'!G41","v":0},{"$f":"'5.2, 5.4 - COOLING'!N41","v":0},{"$f":"'5.2, 5.4 - COOLING'!O41","v":0},{"$f":"'5.2, 5.4 - COOLING'!Q41","v":0},{"$f":"'5.2, 5.4 - COOLING'!N41","v":0},{"$f":"'5.2, 5.4 - COOLING'!P41","v":0}]
[null,null,"5.7.3","Cooling Distribution - Pressure Control Set-points","NA","NA",{"$f":"'5.2, 5.4 - COOLING'!G42","v":0},{"$f":"'5.2, 5.4 - COOLING'!N42","v":0},{"$f":"'5.2, 5.4 - COOLING'!O42","v":0},{"$f":"'5.2, 5.4 - COOLING'!Q42","v":0},{"$f":"'5.2, 5.4 - COOLING'!N42","v":0},{"$f":"'5.2, 5.4 - COOLING'!P42","v":0}]
[null,null,"5.7.4","Cooling Distribution - Pipe Insulation","NA","NA",{"$f":"'5.2, 5.4 - COOLING'!G43","v":0},{"$f":"'5.2, 5.4 - COOLING'!N43","v":0},{"$f":"'5.2, 5.4 - COOLING'!O43","v":0},{"$f":"'5.2, 5.4 - COOLING'!Q43","v":0},{"$f":"'5.2, 5.4 - COOLING'!N43","v":0},{"$f":"'5.2, 5.4 - COOLING'!P43","v":0}]
[null,null,"5.7.5","Cooling Terminal Units - Thermostatic Controls","NA","NA",{"$f":"'5.2, 5.4 - COOLING'!G44","v":0},{"$f":"'5.2, 5.4 - COOLING'!N44","v":0},{"$f":"'5.2, 5.4 - COOLING'!O44","v":0},{"$f":"'5.2, 5.4 - COOLING'!Q44","v":0},{"$f":"'5.2, 5.4 - COOLING'!N44","v":0},{"$f":"'5.2, 5.4 - COOLING'!P44","v":0}]
[null,null,"5.7.6","Cooling System - Airflow and Nameplate Data","NA","NA","NA","NA","NA",{"$f":"'5.2, 5.4 - COOLING'!Q45","v":0},"NA",{"$f":"'5.2, 5.4 - COOLING'!P45","v":0}]
[null,null,null,"ALL FORCED AIR COOLING SYSTEMS (Including heat pumps, split system ACs, PTACs and room ACs where applicable)"]
[null,null,"5.8.1","Cooling Distribution System - In-Unit Duct Sizing","NA","NA",{"$f":"'5.2, 5.4 - COOLING'!G47","v":0},{"$f":"'5.2, 5.4 - COOLING'!N47","v":0},{"$f":"'5.2, 5.4 - COOLING'!O47","v":0},{"$f":"'5.2, 5.4 - COOLING'!Q47","v":0},{"$f":"'5.2, 5.4 - COOLING'!N47","v":0},{"$f":"'5.2, 5.4 - COOLING'!P47","v":0}]
[null,null,"5.8.2","Cooling Distribution System - In-Unit Pressure Balancing","NA","NA",{"$f":"'5.2, 5.4 - COOLING'!G48","v":0},{"$f":"'5.2, 5.4 - COOLING'!N48","v":0},{"$f":"'5.2, 5.4 - COOLING'!O48","v":0},{"$f":"'5.2, 5.4 - COOLING'!Q48","v":0},{"$f":"'5.2, 5.4 - COOLING'!N48","v":0},{"$f":"'5.2, 5.4 - COOLING'!P48","v":0}]
[null,null,"5.8.3","Cooling Distribution - Duct Insulation","NA","NA",{"$f":"'5.2, 5.4 - COOLING'!G49","v":0},{"$f":"'5.2, 5.4 - COOLING'!N49","v":0},{"$f":"'5.2, 5.4 - COOLING'!O49","v":0},{"$f":"'5.2, 5.4 - COOLING'!Q49","v":0},{"$f":"'5.2, 5.4 - COOLING'!N49","v":0},{"$f":"'5.2, 5.4 - COOLING'!P49","v":0}]
[null,null,"5.8.4","Cooling System - Outdoor Air Damper","NA","NA",{"$f":"'5.2, 5.4 - COOLING'!G50","v":0},{"$f":"'5.2, 5.4 - COOLING'!N50","v":0},{"$f":"'5.2, 5.4 - COOLING'!O50","v":0},{"$f":"'5.2, 5.4 - COOLING'!Q50","v":0},{"$f":"'5.2, 5.4 - COOLING'!N50","v":0},{"$f":"'5.2, 5.4 - COOLING'!P50","v":0}]
[null,null,"5.8.5","Cooling Distribution - Duct Sealing Details","NA","NA",{"$f":"'5.2, 5.4 - COOLING'!G51","v":0},{"$f":"'5.2, 5.4 - COOLING'!N51","v":0},{"$f":"'5.2, 5.4 - COOLING'!O51","v":0},{"$f":"'5.2, 5.4 - COOLING'!Q51","v":0},{"$f":"'5.2, 5.4 - COOLING'!N51","v":0},{"$f":"'5.2, 5.4 - COOLING'!P51","v":0}]
[null,null,"5.8.6","Cooling Distribution - Flex Duct Installation","NA","NA",{"$f":"'5.2, 5.4 - COOLING'!G52","v":0},{"$f":"'5.2, 5.4 - COOLING'!N52","v":0},{"$f":"'5.2, 5.4 - COOLING'!O52","v":0},{"$f":"'5.2, 5.4 - COOLING'!Q52","v":0},{"$f":"'5.2, 5.4 - COOLING'!N52","v":0},{"$f":"'5.2, 5.4 - COOLING'!P52","v":0}]
[null,null,"5.8.7","Cooling Distribution - In-Unit Duct Leakage Testing","NA","NA",{"$f":"'5.2, 5.4 - COOLING'!G57","v":0},{"$f":"'5.2, 5.4 - COOLING'!N57","v":0},{"$f":"'5.2, 5.4 - COOLING'!O57","v":0},{"$f":"'5.2, 5.4 - COOLING'!Q53","v":0},"NA",{"$f":"'5.2, 5.4 - COOLING'!P53","v":0}]
[null,null,"5.8.8","Cooling System - HVAC Contractor Checklist","NA","NA",{"$f":"'5.2, 5.4 - COOLING'!G58","v":0},{"$f":"'5.2, 5.4 - COOLING'!N58","v":0},{"$f":"'5.2, 5.4 - COOLING'!O58","v":0},{"$f":"'5.2, 5.4 - COOLING'!Q54","v":0},"NA",{"$f":"'5.2, 5.4 - COOLING'!P54","v":0}]
[null,null,"5.8.9","Cooling System - Refrigerant Charge, Airflow and Nameplate Data","NA","NA","NA","NA","NA",{"$f":"'5.2, 5.4 - COOLING'!Q55","v":0},"NA",{"$f":"'5.2, 5.4 - COOLING'!P55","v":0}]
[null,null,"COOLING SYSTEMS MISC"]
[null,null,"5.9.1","Cooling - A/C Sleeves","NA","NA",{"$f":"'5.2, 5.4 - COOLING'!G57","v":0},{"$f":"'5.2, 5.4 - COOLING'!N57","v":0},{"$f":"'5.2, 5.4 - COOLING'!O57","v":0},{"$f":"'5.2, 5.4 - COOLING'!Q57","v":0},{"$f":"'5.2, 5.4 - COOLING'!N57","v":0},{"$f":"'5.2, 5.4 - COOLING'!P57","v":0}]
[null,null,"5.9.2","Cooling Distribution - Thermostat","NA","NA",{"$f":"'5.2, 5.4 - COOLING'!G58","v":0},{"$f":"'5.2, 5.4 - COOLING'!N58","v":0},{"$f":"'5.2, 5.4 - COOLING'!O58","v":0},{"$f":"'5.2, 5.4 - COOLING'!Q58","v":0},{"$f":"'5.2, 5.4 - COOLING'!N58","v":0},{"$f":"'5.2, 5.4 - COOLING'!P58","v":0}]
[null,null,"5.9.3","Cooling - Training and Manuals","NA","NA","NA","NA","NA",{"$f":"'5.2, 5.4 - COOLING'!Q59","v":0},"NA",{"$f":"'5.2, 5.4 - COOLING'!P59","v":0}]
[null,null,"5.9.4","Cooling - Manufacturer's Product Data","NA","NA","NA","NA","NA",{"$f":"'5.2, 5.4 - COOLING'!Q60","v":0},"NA",{"$f":"'5.2, 5.4 - COOLING'!P60","v":0}]
[null,null,6,"LIGHTING"]
[null,null,"6.1.1","Compliance Statement","NA","NA",{"$f":"'6.1, 6.2, 6.3 - LIGHTING'!J96","v":0},{"$f":"'6.1, 6.2, 6.3 - LIGHTING'!K96","v":0},{"$f":"'6.1, 6.2, 6.3 - LIGHTING'!L96","v":0},{"$f":"'6.1, 6.2, 6.3 - LIGHTING'!N96","v":0},{"$f":"'6.1, 6.2, 6.3 - LIGHTING'!K96","v":0},{"$f":"'6.1, 6.2, 6.3 - LIGHTING'!M96","v":0}]
[null,null,"6.1.2","Lighting Power Density","NA","NA",{"$f":"'6.1, 6.2, 6.3 - LIGHTING'!J28","v":0},{"$f":"'6.1, 6.2, 6.3 - LIGHTING'!K28","v":0},{"$f":"'6.1, 6.2, 6.3 - LIGHTING'!L28","v":0},{"$f":"'6.1, 6.2, 6.3 - LIGHTING'!N28","v":0},{"$f":"'6.1, 6.2, 6.3 - LIGHTING'!K28","v":0},{"$f":"'6.1, 6.2, 6.3 - LIGHTING'!M28","v":0}]
[null,null,"6.1.3","Lighting Controls - Verification",{"$f":"'6.1, 6.2, 6.3 - LIGHTING'!F97","v":0},{"$f":"'6.1, 6.2, 6.3 - LIGHTING'!H97","v":0},{"$f":"'6.1, 6.2, 6.3 - LIGHTING'!J97","v":0},{"$f":"'6.1, 6.2, 6.3 - LIGHTING'!K97","v":0},{"$f":"'6.1, 6.2, 6.3 - LIGHTING'!L97","v":0},{"$f":"'6.1, 6.2, 6.3 - LIGHTING'!N97","v":0},{"$f":"'6.1, 6.2, 6.3 - LIGHTING'!K97","v":0},{"$f":"'6.1, 6.2, 6.3 - LIGHTING'!M97","v":0}]
[null,null,"6.1.4","Common Area Lighting - ENERGY STAR",{"$f":"'6.1, 6.2, 6.3 - LIGHTING'!F98","v":0},{"$f":"'6.1, 6.2, 6.3 - LIGHTING'!H98","v":0},{"$f":"'6.1, 6.2, 6.3 - LIGHTING'!J98","v":0},{"$f":"'6.1, 6.2, 6.3 - LIGHTING'!K98","v":0},{"$f":"'6.1, 6.2, 6.3 - LIGHTING'!L98","v":0},{"$f":"'6.1, 6.2, 6.3 - LIGHTING'!N98","v":0},{"$f":"'6.1, 6.2, 6.3 - LIGHTING'!K98","v":0},{"$f":"'6.1, 6.2, 6.3 - LIGHTING'!M98","v":0}]
[null,null,"6.1.5","Common Area Lighting - LPD",{"$f":"'6.1, 6.2, 6.3 - LIGHTING'!F98","v":0},{"$f":"'6.1, 6.2, 6.3 - LIGHTING'!H98","v":0},{"$f":"'6.1, 6.2, 6.3 - LIGHTING'!J99","v":0},{"$f":"'6.1, 6.2, 6.3 - LIGHTING'!K99","v":0},{"$f":"'6.1, 6.2, 6.3 - LIGHTING'!L99","v":0},{"$f":"'6.1, 6.2, 6.3 - LIGHTING'!N99","v":0},{"$f":"'6.1, 6.2, 6.3 - LIGHTING'!K99","v":0},{"$f":"'6.1, 6.2, 6.3 - LIGHTING'!M99","v":0}]
[null,null,"6.1.6","Emergency Lighting - Exit Signs",{"$f":"'6.1, 6.2, 6.3 - LIGHTING'!F100","v":0},{"$f":"'6.1, 6.2, 6.3 - LIGHTING'!H100","v":0},{"$f":"'6.1, 6.2, 6.3 - LIGHTING'!J100","v":0},{"$f":"'6.1, 6.2, 6.3 - LIGHTING'!K100","v":0},{"$f":"'6.1, 6.2, 6.3 - LIGHTING'!L100","v":0},{"$f":"'6.1, 6.2, 6.3 - LIGHTING'!N100","v":0},{"$f":"'6.1, 6.2, 6.3 - LIGHTING'!K100","v":0},{"$f":"'6.1, 6.2, 6.3 - LIGHTING'!M100","v":0}]
[null,null,"6.1.7","Exterior Lighting - Controls",{"$f":"'6.1, 6.2, 6.3 - LIGHTING'!F101","v":0},{"$f":"'6.1, 6.2, 6.3 - LIGHTING'!H101","v":0},{"$f":"'6.1, 6.2, 6.3 - LIGHTING'!J101","v":0},{"$f":"'6.1, 6.2, 6.3 - LIGHTING'!K101","v":0},{"$f":"'6.1, 6.2, 6.3 - LIGHTING'!L101","v":0},{"$f":"'6.1, 6.2, 6.3 - LIGHTING'!N101","v":0},{"$f":"'6.1, 6.2, 6.3 - LIGHTING'!K101","v":0},{"$f":"'6.1, 6.2, 6.3 - LIGHTING'!M101","v":0}]
[null,null,"6.1.8","Exterior Lighting - ENERGY STAR",{"$f":"'6.1, 6.2, 6.3 - LIGHTING'!F101","v":0},{"$f":"'6.1, 6.2, 6.3 - LIGHTING'!H101","v":0},{"$f":"'6.1, 6.2, 6.3 - LIGHTING'!J102","v":0},{"$f":"'6.1, 6.2, 6.3 - LIGHTING'!K102","v":0},{"$f":"'6.1, 6.2, 6.3 - LIGHTING'!L102","v":0},{"$f":"'6.1, 6.2, 6.3 - LIGHTING'!N102","v":0},{"$f":"'6.1, 6.2, 6.3 - LIGHTING'!K102","v":0},{"$f":"'6.1, 6.2, 6.3 - LIGHTING'!M102","v":0}]
[null,null,"6.1.9","Exterior Lighting - LPD (Prescriptive Path)",{"$f":"'6.1, 6.2, 6.3 - LIGHTING'!F101","v":0},{"$f":"'6.1, 6.2, 6.3 - LIGHTING'!H101","v":0},{"$f":"'6.1, 6.2, 6.3 - LIGHTING'!J103","v":0},{"$f":"'6.1, 6.2, 6.3 - LIGHTING'!K103","v":0},{"$f":"'6.1, 6.2, 6.3 - LIGHTING'!L103","v":0},{"$f":"'6.1, 6.2, 6.3 - LIGHTING'!N103","v":0},{"$f":"'6.1, 6.2, 6.3 - LIGHTING'!K103","v":0},{"$f":"'6.1, 6.2, 6.3 - LIGHTING'!M103","v":0}]
[null,null,"6.1.10","In-Unit Lighting  ",{"$f":"'6.1, 6.2, 6.3 - LIGHTING'!F104","v":0},{"$f":"'6.1, 6.2, 6.3 - LIGHTING'!H104","v":0},{"$f":"'6.1, 6.2, 6.3 - LIGHTING'!J104","v":0},{"$f":"'6.1, 6.2, 6.3 - LIGHTING'!K104","v":0},{"$f":"'6.1, 6.2, 6.3 - LIGHTING'!L104","v":0},{"$f":"'6.1, 6.2, 6.3 - LIGHTING'!N104","v":0},{"$f":"'6.1, 6.2, 6.3 - LIGHTING'!K104","v":0},{"$f":"'6.1, 6.2, 6.3 - LIGHTING'!M104","v":0}]
[null,null,null,"INSPECTION ONLY"]
[null,null,"6.2.1","Lighting - Ballasts","NA","NA","NA","NA","NA",{"$f":"'6.1, 6.2, 6.3 - LIGHTING'!N105","v":0},"NA",{"$f":"'6.1, 6.2, 6.3 - LIGHTING'!M105","v":0}]
[null,null,"6.2.2","Lighting - Statement of Substantial Completion - Non 24/7 Spaces","NA","NA","NA","NA","NA",{"$f":"'6.1, 6.2, 6.3 - LIGHTING'!N106","v":0},"NA",{"$f":"'6.1, 6.2, 6.3 - LIGHTING'!M106","v":0}]
[null,null,7,"MOTORS"]
[null,null,"7.1.1","Motors - Notes for Drawings and Specifications","NA","NA",{"$f":"'7.1 - MOTORS'!$H$23","v":0},{"$f":"'7.1 - MOTORS'!$J$23","v":0},{"$f":"'7.1 - MOTORS'!$K$23","v":0},"NA","NA","NA"]
[null,null,"7.1.3","Heating Distribution - Motors",{"$f":"'7.1 - MOTORS'!F34","v":0},{"$f":"'7.1 - MOTORS'!G34","v":0},{"$f":"'7.1 - MOTORS'!H34","v":0},{"$f":"'7.1 - MOTORS'!J34","v":0},{"$f":"'7.1 - MOTORS'!K34","v":0},{"$f":"'7.1 - MOTORS'!M34","v":0},{"$f":"'7.1 - MOTORS'!J34","v":0},{"$f":"'7.1 - MOTORS'!L34","v":0}]
[null,null,"7.1.4","Cooling Distribution - Motors",{"$f":"'7.1 - MOTORS'!F35","v":0},{"$f":"'7.1 - MOTORS'!G35","v":0},{"$f":"'7.1 - MOTORS'!H35","v":0},{"$f":"'7.1 - MOTORS'!J35","v":0},{"$f":"'7.1 - MOTORS'!K35","v":0},{"$f":"'7.1 - MOTORS'!M35","v":0},{"$f":"'7.1 - MOTORS'!J35","v":0},{"$f":"'7.1 - MOTORS'!L35","v":0}]
[null,null,"7.1.5","DHW Distribution - Motors",{"$f":"'7.1 - MOTORS'!F36","v":0},{"$f":"'7.1 - MOTORS'!G36","v":0},{"$f":"'7.1 - MOTORS'!H36","v":0},{"$f":"'7.1 - MOTORS'!J36","v":0},{"$f":"'7.1 - MOTORS'!K36","v":0},{"$f":"'7.1 - MOTORS'!M36","v":0},{"$f":"'7.1 - MOTORS'!J36","v":0},{"$f":"'7.1 - MOTORS'!L36","v":0}]
[null,null,"7.1.6","Motors- Manufacturer's Product Data","NA","NA","NA","NA","NA",{"$f":"'7.1 - MOTORS'!M37","v":0},"NA",{"$f":"'7.1 - MOTORS'!L37","v":0}]
[null,null,"7.1.7","Heating and DHW - Training and Manuals","NA","NA","NA","NA","NA",{"$f":"'7.1 - MOTORS'!M38","v":0},"NA",{"$f":"'7.1 - MOTORS'!L38","v":0}]
[null,null,"7.1.8","Statement of Substantial Completion","NA","NA","NA","NA","NA",{"$f":"'7.1 - MOTORS'!M39","v":0},"NA",{"$f":"'7.1 - MOTORS'!L39","v":0}]
[null,null,8,"INFILTRATION"]
[null,null,null,"EXTERIOR AIR BARRIERS"]
[null,null,"8.1.1","General Exterior Enclosure - Notes for Drawings and Specifications","NA","NA",{"$f":"'8.1 - INF_EXT AIR BARRIER'!$F$31","v":0},{"$f":"'8.1 - INF_EXT AIR BARRIER'!$G$31","v":0},{"$f":"'8.1 - INF_EXT AIR BARRIER'!$H$31","v":0},"NA","NA","NA"]
[null,null,"8.1.2","Exterior Enclosure Air Barriers - Notes for Drawings and Specifications","NA","NA",{"$f":"'8.1 - INF_EXT AIR BARRIER'!$F$32","v":0},{"$f":"'8.1 - INF_EXT AIR BARRIER'!$G$32","v":0},{"$f":"'8.1 - INF_EXT AIR BARRIER'!$H$32","v":0},"NA","NA","NA"]
[null,null,"8.1.3","Exterior Air Barrier - Compliance Statement","NA","NA",{"$f":"'8.1 - INF_EXT AIR BARRIER'!F47","v":0},{"$f":"'8.1 - INF_EXT AIR BARRIER'!G47","v":0},{"$f":"'8.1 - INF_EXT AIR BARRIER'!H47","v":0},{"$f":"'8.1 - INF_EXT AIR BARRIER'!J47","v":0},{"$f":"'8.1 - INF_EXT AIR BARRIER'!G47","v":0},{"$f":"'8.1 - INF_EXT AIR BARRIER'!I47","v":0}]
[null,null,"8.1.4","Wood-Framed Construction","NA","NA",{"$f":"'8.1 - INF_EXT AIR BARRIER'!F48","v":0},{"$f":"'8.1 - INF_EXT AIR BARRIER'!G48","v":0},{"$f":"'8.1 - INF_EXT AIR BARRIER'!H48","v":0},{"$f":"'8.1 - INF_EXT AIR BARRIER'!J48","v":0},{"$f":"'8.1 - INF_EXT AIR BARRIER'!G48","v":0},{"$f":"'8.1 - INF_EXT AIR BARRIER'!I48","v":0}]
[null,null,"8.1.5","Masonry Wall Preparation","NA","NA",{"$f":"'8.1 - INF_EXT AIR BARRIER'!F49","v":0},{"$f":"'8.1 - INF_EXT AIR BARRIER'!G49","v":0},{"$f":"'8.1 - INF_EXT AIR BARRIER'!H49","v":0},{"$f":"'8.1 - INF_EXT AIR BARRIER'!J49","v":0},{"$f":"'8.1 - INF_EXT AIR BARRIER'!G49","v":0},{"$f":"'8.1 - INF_EXT AIR BARRIER'!I49","v":0}]
[null,null,"8.1.6","Gypsum Sheathing Wall Preparation","NA","NA",{"$f":"'8.1 - INF_EXT AIR BARRIER'!F50","v":0},{"$f":"'8.1 - INF_EXT AIR BARRIER'!G50","v":0},{"$f":"'8.1 - INF_EXT AIR BARRIER'!H50","v":0},{"$f":"'8.1 - INF_EXT AIR BARRIER'!J50","v":0},{"$f":"'8.1 - INF_EXT AIR BARRIER'!G50","v":0},{"$f":"'8.1 - INF_EXT AIR BARRIER'!I50","v":0}]
[null,null,"8.1.7","General Coverage - Liquid Membrane","NA","NA",{"$f":"'8.1 - INF_EXT AIR BARRIER'!F51","v":0},{"$f":"'8.1 - INF_EXT AIR BARRIER'!G51","v":0},{"$f":"'8.1 - INF_EXT AIR BARRIER'!H51","v":0},{"$f":"'8.1 - INF_EXT AIR BARRIER'!J51","v":0},{"$f":"'8.1 - INF_EXT AIR BARRIER'!G51","v":0},{"$f":"'8.1 - INF_EXT AIR BARRIER'!I51","v":0}]
[null,null,"8.1.8","General Coverage at Adjacent Building Conditions - Liquid Membrane","NA","NA",{"$f":"'8.1 - INF_EXT AIR BARRIER'!F52","v":0},{"$f":"'8.1 - INF_EXT AIR BARRIER'!G52","v":0},{"$f":"'8.1 - INF_EXT AIR BARRIER'!H52","v":0},{"$f":"'8.1 - INF_EXT AIR BARRIER'!J52","v":0},{"$f":"'8.1 - INF_EXT AIR BARRIER'!G52","v":0},{"$f":"'8.1 - INF_EXT AIR BARRIER'!I52","v":0}]
[null,null,"8.1.9","General Coverage / Transition Membrane - Seams","NA","NA",{"$f":"'8.1 - INF_EXT AIR BARRIER'!F53","v":0},{"$f":"'8.1 - INF_EXT AIR BARRIER'!G53","v":0},{"$f":"'8.1 - INF_EXT AIR BARRIER'!H53","v":0},{"$f":"'8.1 - INF_EXT AIR BARRIER'!J53","v":0},{"$f":"'8.1 - INF_EXT AIR BARRIER'!G53","v":0},{"$f":"'8.1 - INF_EXT AIR BARRIER'!I53","v":0}]
[null,null,"8.1.10","Air Barrier Penetrations","NA","NA",{"$f":"'8.1 - INF_EXT AIR BARRIER'!F54","v":0},{"$f":"'8.1 - INF_EXT AIR BARRIER'!G54","v":0},{"$f":"'8.1 - INF_EXT AIR BARRIER'!H54","v":0},{"$f":"'8.1 - INF_EXT AIR BARRIER'!J54","v":0},{"$f":"'8.1 - INF_EXT AIR BARRIER'!G54","v":0},{"$f":"'8.1 - INF_EXT AIR BARRIER'!I54","v":0}]
[null,null,"8.1.11","Rough Openings (Concrete Masonry Construction) - Windows and Doors","NA","NA",{"$f":"'8.1 - INF_EXT AIR BARRIER'!F55","v":0},{"$f":"'8.1 - INF_EXT AIR BARRIER'!G55","v":0},{"$f":"'8.1 - INF_EXT AIR BARRIER'!H55","v":0},{"$f":"'8.1 - INF_EXT AIR BARRIER'!J55","v":0},{"$f":"'8.1 - INF_EXT AIR BARRIER'!G55","v":0},{"$f":"'8.1 - INF_EXT AIR BARRIER'!I55","v":0}]
[null,null,"8.1.12","Rough Openings (Steel Stud Construction) - Windows and Doors","NA","NA",{"$f":"'8.1 - INF_EXT AIR BARRIER'!F56","v":0},{"$f":"'8.1 - INF_EXT AIR BARRIER'!G56","v":0},{"$f":"'8.1 - INF_EXT AIR BARRIER'!H56","v":0},{"$f":"'8.1 - INF_EXT AIR BARRIER'!J56","v":0},{"$f":"'8.1 - INF_EXT AIR BARRIER'!G56","v":0},{"$f":"'8.1 - INF_EXT AIR BARRIER'!I56","v":0}]
[null,null,"8.1.13","Rough Openings - Pipes, Conduits, Ducts, Etc","NA","NA",{"$f":"'8.1 - INF_EXT AIR BARRIER'!F57","v":0},{"$f":"'8.1 - INF_EXT AIR BARRIER'!G57","v":0},{"$f":"'8.1 - INF_EXT AIR BARRIER'!H57","v":0},{"$f":"'8.1 - INF_EXT AIR BARRIER'!J57","v":0},{"$f":"'8.1 - INF_EXT AIR BARRIER'!G57","v":0},{"$f":"'8.1 - INF_EXT AIR BARRIER'!I57","v":0}]
[null,null,"8.1.14","Rough Openings - Cast Stone Sills","NA","NA",{"$f":"'8.1 - INF_EXT AIR BARRIER'!F58","v":0},{"$f":"'8.1 - INF_EXT AIR BARRIER'!G58","v":0},{"$f":"'8.1 - INF_EXT AIR BARRIER'!H58","v":0},{"$f":"'8.1 - INF_EXT AIR BARRIER'!J58","v":0},{"$f":"'8.1 - INF_EXT AIR BARRIER'!G58","v":0},{"$f":"'8.1 - INF_EXT AIR BARRIER'!I58","v":0}]
[null,null,"8.1.15","Rough Openings - Gap at Window Frame","NA","NA",{"$f":"'8.1 - INF_EXT AIR BARRIER'!F59","v":0},{"$f":"'8.1 - INF_EXT AIR BARRIER'!G59","v":0},{"$f":"'8.1 - INF_EXT AIR BARRIER'!H59","v":0},{"$f":"'8.1 - INF_EXT AIR BARRIER'!J59","v":0},{"$f":"'8.1 - INF_EXT AIR BARRIER'!G59","v":0},{"$f":"'8.1 - INF_EXT AIR BARRIER'!I59","v":0}]
[null,null,"8.1.16","Rough Openings - Gap at Door Frame","NA","NA",{"$f":"'8.1 - INF_EXT AIR BARRIER'!F60","v":0},{"$f":"'8.1 - INF_EXT AIR BARRIER'!G60","v":0},{"$f":"'8.1 - INF_EXT AIR BARRIER'!H60","v":0},{"$f":"'8.1 - INF_EXT AIR BARRIER'!J60","v":0},{"$f":"'8.1 - INF_EXT AIR BARRIER'!G60","v":0},{"$f":"'8.1 - INF_EXT AIR BARRIER'!I60","v":0}]
[null,null,"8.1.17","Doors - Weatherstripping","NA","NA",{"$f":"'8.1 - INF_EXT AIR BARRIER'!F61","v":0},{"$f":"'8.1 - INF_EXT AIR BARRIER'!G61","v":0},{"$f":"'8.1 - INF_EXT AIR BARRIER'!H61","v":0},{"$f":"'8.1 - INF_EXT AIR BARRIER'!J61","v":0},{"$f":"'8.1 - INF_EXT AIR BARRIER'!G61","v":0},{"$f":"'8.1 - INF_EXT AIR BARRIER'!I61","v":0}]
[null,null,"8.1.18","Rough Openings - A/C Sleeves","NA","NA",{"$f":"'8.1 - INF_EXT AIR BARRIER'!F62","v":0},{"$f":"'8.1 - INF_EXT AIR BARRIER'!G62","v":0},{"$f":"'8.1 - INF_EXT AIR BARRIER'!H62","v":0},{"$f":"'8.1 - INF_EXT AIR BARRIER'!J62","v":0},{"$f":"'8.1 - INF_EXT AIR BARRIER'!G62","v":0},{"$f":"'8.1 - INF_EXT AIR BARRIER'!I62","v":0}]
[null,null,"8.1.19","Plank Edges (Steel Stud Construction) - At plank / exterior sheathing joint","NA","NA",{"$f":"'8.1 - INF_EXT AIR BARRIER'!F63","v":0},{"$f":"'8.1 - INF_EXT AIR BARRIER'!G63","v":0},{"$f":"'8.1 - INF_EXT AIR BARRIER'!H63","v":0},{"$f":"'8.1 - INF_EXT AIR BARRIER'!J63","v":0},{"$f":"'8.1 - INF_EXT AIR BARRIER'!G63","v":0},{"$f":"'8.1 - INF_EXT AIR BARRIER'!I63","v":0}]
[null,null,"8.1.20","Plank Edges (Concrete Masonry Construction) -\nAt plank / CMU joint","NA","NA",{"$f":"'8.1 - INF_EXT AIR BARRIER'!F64","v":0},{"$f":"'8.1 - INF_EXT AIR BARRIER'!G64","v":0},{"$f":"'8.1 - INF_EXT AIR BARRIER'!H64","v":0},{"$f":"'8.1 - INF_EXT AIR BARRIER'!J64","v":0},{"$f":"'8.1 - INF_EXT AIR BARRIER'!G64","v":0},{"$f":"'8.1 - INF_EXT AIR BARRIER'!I64","v":0}]
[null,null,"8.1.21","Plank Edges - At plank / steel girder joint","NA","NA",{"$f":"'8.1 - INF_EXT AIR BARRIER'!F65","v":0},{"$f":"'8.1 - INF_EXT AIR BARRIER'!G65","v":0},{"$f":"'8.1 - INF_EXT AIR BARRIER'!H65","v":0},{"$f":"'8.1 - INF_EXT AIR BARRIER'!J65","v":0},{"$f":"'8.1 - INF_EXT AIR BARRIER'!G65","v":0},{"$f":"'8.1 - INF_EXT AIR BARRIER'!I65","v":0}]
[null,null,"8.1.22","Steel Columns - Steel / CMU joints","NA","NA",{"$f":"'8.1 - INF_EXT AIR BARRIER'!F66","v":0},{"$f":"'8.1 - INF_EXT AIR BARRIER'!G66","v":0},{"$f":"'8.1 - INF_EXT AIR BARRIER'!H66","v":0},{"$f":"'8.1 - INF_EXT AIR BARRIER'!J66","v":0},{"$f":"'8.1 - INF_EXT AIR BARRIER'!G66","v":0},{"$f":"'8.1 - INF_EXT AIR BARRIER'!I66","v":0}]
[null,null,"8.1.23","Wall to Roof Connections","NA","NA",{"$f":"'8.1 - INF_EXT AIR BARRIER'!F67","v":0},{"$f":"'8.1 - INF_EXT AIR BARRIER'!G67","v":0},{"$f":"'8.1 - INF_EXT AIR BARRIER'!H67","v":0},{"$f":"'8.1 - INF_EXT AIR BARRIER'!J67","v":0},{"$f":"'8.1 - INF_EXT AIR BARRIER'!G67","v":0},{"$f":"'8.1 - INF_EXT AIR BARRIER'!I67","v":0}]
[null,null,"8.1.24","Transition between foundations and walls","NA","NA",{"$f":"'8.1 - INF_EXT AIR BARRIER'!F68","v":0},{"$f":"'8.1 - INF_EXT AIR BARRIER'!G68","v":0},{"$f":"'8.1 - INF_EXT AIR BARRIER'!H68","v":0},{"$f":"'8.1 - INF_EXT AIR BARRIER'!J68","v":0},{"$f":"'8.1 - INF_EXT AIR BARRIER'!G68","v":0},{"$f":"'8.1 - INF_EXT AIR BARRIER'!I68","v":0}]
[null,null,"8.1.25","Transition between one wall type and another","NA","NA",{"$f":"'8.1 - INF_EXT AIR BARRIER'!F69","v":0},{"$f":"'8.1 - INF_EXT AIR BARRIER'!G69","v":0},{"$f":"'8.1 - INF_EXT AIR BARRIER'!H69","v":0},{"$f":"'8.1 - INF_EXT AIR BARRIER'!J69","v":0},{"$f":"'8.1 - INF_EXT AIR BARRIER'!G69","v":0},{"$f":"'8.1 - INF_EXT AIR BARRIER'!I69","v":0}]
[null,null,"8.1.26","Transition at inside and outside corners\n","NA","NA",{"$f":"'8.1 - INF_EXT AIR BARRIER'!F70","v":0},{"$f":"'8.1 - INF_EXT AIR BARRIER'!G70","v":0},{"$f":"'8.1 - INF_EXT AIR BARRIER'!H70","v":0},{"$f":"'8.1 - INF_EXT AIR BARRIER'!J70","v":0},{"$f":"'8.1 - INF_EXT AIR BARRIER'!G70","v":0},{"$f":"'8.1 - INF_EXT AIR BARRIER'!I70","v":0}]
[null,null,"8.1.27","Transition between exterior enclosure and interior walls, floors and ceilings that bound non-conditioned spaces ","NA","NA",{"$f":"'8.1 - INF_EXT AIR BARRIER'!F71","v":0},{"$f":"'8.1 - INF_EXT AIR BARRIER'!G71","v":0},{"$f":"'8.1 - INF_EXT AIR BARRIER'!H71","v":0},{"$f":"'8.1 - INF_EXT AIR BARRIER'!J71","v":0},{"$f":"'8.1 - INF_EXT AIR BARRIER'!G71","v":0},{"$f":"'8.1 - INF_EXT AIR BARRIER'!I71","v":0}]
[null,null,"8.1.28","Other","NA","NA",{"$f":"'8.1 - INF_EXT AIR BARRIER'!F72","v":0},{"$f":"'8.1 - INF_EXT AIR BARRIER'!G72","v":0},{"$f":"'8.1 - INF_EXT AIR BARRIER'!H72","v":0},{"$f":"'8.1 - INF_EXT AIR BARRIER'!J72","v":0},{"$f":"'8.1 - INF_EXT AIR BARRIER'!G72","v":0},{"$f":"'8.1 - INF_EXT AIR BARRIER'!I72","v":0}]
[null,null,null,"COMPARTMENTALIZATION - VISUAL INSPECTION"]
[null,null,"8.2.1","Compartmentalization - Notes for Drawings and Specifications","NA","NA",{"$f":"'8.1-INF_COMPTZN VIS INSPECTION'!$F$29","v":0},{"$f":"'8.1-INF_COMPTZN VIS INSPECTION'!$G$29","v":0},{"$f":"'8.1-INF_COMPTZN VIS INSPECTION'!$H$29","v":0},"NA","NA","NA"]
[null,null,"8.2.2","Compartmentalization Visual Inspection - General","NA","NA",{"$f":"'8.1-INF_COMPTZN VIS INSPECTION'!F31","v":0},{"$f":"'8.1-INF_COMPTZN VIS INSPECTION'!G31","v":0},{"$f":"'8.1-INF_COMPTZN VIS INSPECTION'!H31","v":0},{"$f":"'8.1-INF_COMPTZN VIS INSPECTION'!J31","v":0},{"$f":"'8.1-INF_COMPTZN VIS INSPECTION'!G31","v":0},{"$f":"'8.1-INF_COMPTZN VIS INSPECTION'!I31","v":0}]
[null,null,"8.2.3","Sample Unit - Visual Inspection","NA","NA","NA","NA","NA",{"$f":"'8.1-INF_COMPTZN VIS INSPECTION'!J32","v":0},"NA",{"$f":"'8.1-INF_COMPTZN VIS INSPECTION'!I32","v":0}]
[null,null,"8.2.4","Inspect framing layout","NA","NA","NA","NA","NA",{"$f":"'8.1-INF_COMPTZN VIS INSPECTION'!J33","v":0},"NA",{"$f":"'8.1-INF_COMPTZN VIS INSPECTION'!I33","v":0}]
[null,null,"8.2.5","Gypsum board to concrete floor plank connection ","NA","NA","NA","NA","NA",{"$f":"'8.1-INF_COMPTZN VIS INSPECTION'!J35","v":0},"NA",{"$f":"'8.1-INF_COMPTZN VIS INSPECTION'!I35","v":0}]
[null,null,"8.2.6","Gypsum board to concrete ceiling plank connection","NA","NA","NA","NA","NA",{"$f":"'8.1-INF_COMPTZN VIS INSPECTION'!J34","v":0},"NA",{"$f":"'8.1-INF_COMPTZN VIS INSPECTION'!I34","v":0}]
[null,null,"8.2.7","Window to interior gypsum board","NA","NA","NA","NA","NA",{"$f":"'8.1-INF_COMPTZN VIS INSPECTION'!J37","v":0},"NA",{"$f":"'8.1-INF_COMPTZN VIS INSPECTION'!I37","v":0}]
[null,null,"8.2.8","A/C Sleeve Cover (if A/Cs provided by building)","NA","NA","NA","NA","NA",{"$f":"'8.1-INF_COMPTZN VIS INSPECTION'!J36","v":0},"NA",{"$f":"'8.1-INF_COMPTZN VIS INSPECTION'!I36","v":0}]
[null,null,"8.2.9","Air conditioner sleeve sealed to drywall","NA","NA","NA","NA","NA",{"$f":"'8.1-INF_COMPTZN VIS INSPECTION'!J38","v":0},"NA",{"$f":"'8.1-INF_COMPTZN VIS INSPECTION'!I38","v":0}]
[null,null,"8.2.10","Outlet/Electrical Box - Exterior and Demising Walls","NA","NA","NA","NA","NA",{"$f":"'8.1-INF_COMPTZN VIS INSPECTION'!J39","v":0},"NA",{"$f":"'8.1-INF_COMPTZN VIS INSPECTION'!I39","v":0}]
[null,null,"8.2.11","Heating pipe penetrations through exterior walls","NA","NA","NA","NA","NA",{"$f":"'8.1-INF_COMPTZN VIS INSPECTION'!J40","v":0},"NA",{"$f":"'8.1-INF_COMPTZN VIS INSPECTION'!I40","v":0}]
[null,null,"8.2.12","Heating pipe penetrations through interior partitions","NA","NA","NA","NA","NA",{"$f":"'8.1-INF_COMPTZN VIS INSPECTION'!J41","v":0},"NA",{"$f":"'8.1-INF_COMPTZN VIS INSPECTION'!I41","v":0}]
[null,null,"8.2.13","Plumbing / Sprinkler Pipe Penetrations","NA","NA","NA","NA","NA",{"$f":"'8.1-INF_COMPTZN VIS INSPECTION'!J42","v":0},"NA",{"$f":"'8.1-INF_COMPTZN VIS INSPECTION'!I42","v":0}]
[null,null,"8.2.14","Range Gas Line Penetration","NA","NA","NA","NA","NA",{"$f":"'8.1-INF_COMPTZN VIS INSPECTION'!J43","v":0},"NA",{"$f":"'8.1-INF_COMPTZN VIS INSPECTION'!I43","v":0}]
[null,null,"8.2.15","Gap between take off duct and gypsum board","NA","NA","NA","NA","NA",{"$f":"'8.1-INF_COMPTZN VIS INSPECTION'!J44","v":0},"NA",{"$f":"'8.1-INF_COMPTZN VIS INSPECTION'!I44","v":0}]
[null,null,"8.2.16","Electrical Panel","NA","NA","NA","NA","NA",{"$f":"'8.1-INF_COMPTZN VIS INSPECTION'!J45","v":0},"NA",{"$f":"'8.1-INF_COMPTZN VIS INSPECTION'!I45","v":0}]
[null,null,"8.2.17","HVAC Access Doors","NA","NA","NA","NA","NA",{"$f":"'8.1-INF_COMPTZN VIS INSPECTION'!J46","v":0},"NA",{"$f":"'8.1-INF_COMPTZN VIS INSPECTION'!I46","v":0}]
[null,null,"8.2.18","Thermostats","NA","NA","NA","NA","NA",{"$f":"'8.1-INF_COMPTZN VIS INSPECTION'!J47","v":0},"NA",{"$f":"'8.1-INF_COMPTZN VIS INSPECTION'!I47","v":0}]
[null,null,"8.2.19","Intercoms","NA","NA","NA","NA","NA",{"$f":"'8.1-INF_COMPTZN VIS INSPECTION'!J48","v":0},"NA",{"$f":"'8.1-INF_COMPTZN VIS INSPECTION'!I48","v":0}]
[null,null,"8.2.20","Lighting Fixtures","NA","NA","NA","NA","NA",{"$f":"'8.1-INF_COMPTZN VIS INSPECTION'!J49","v":0},"NA",{"$f":"'8.1-INF_COMPTZN VIS INSPECTION'!I49","v":0}]
[null,null,"8.2.21","Door Latch Hole","NA","NA","NA","NA","NA",{"$f":"'8.1-INF_COMPTZN VIS INSPECTION'!J50","v":0},"NA",{"$f":"'8.1-INF_COMPTZN VIS INSPECTION'!I50","v":0}]
[null,null,"8.2.22","Medicine Cabinet","NA","NA","NA","NA","NA",{"$f":"'8.1-INF_COMPTZN VIS INSPECTION'!J51","v":0},"NA",{"$f":"'8.1-INF_COMPTZN VIS INSPECTION'!I51","v":0}]
[null,null,"8.2.23","Other","NA","NA","NA","NA","NA",{"$f":"'8.1-INF_COMPTZN VIS INSPECTION'!J52","v":0},"NA",{"$f":"'8.1-INF_COMPTZN VIS INSPECTION'!I52","v":0}]
[null,null,null,"BLOWER DOOR TESTING"]
[null,null,"8.3.1","Blower Door Test - Notes for Drawings and Specifications","NA","NA",{"$f":"'8.1 - INF_BLOWER DOOR TEST'!H30","v":0},{"$f":"'8.1 - INF_BLOWER DOOR TEST'!I30","v":0},{"$f":"'8.1 - INF_BLOWER DOOR TEST'!J30","v":0},"NA","NA","NA"]
[null,null,"8.3.2","Blower Door Test - Compliance Statement","NA","NA",{"$f":"'8.1 - INF_BLOWER DOOR TEST'!H33","v":0},{"$f":"'8.1 - INF_BLOWER DOOR TEST'!I33","v":0},{"$f":"'8.1 - INF_BLOWER DOOR TEST'!J33","v":0},{"$f":"'8.1 - INF_BLOWER DOOR TEST'!L33","v":0},{"$f":"'8.1 - INF_BLOWER DOOR TEST'!I33","v":0},{"$f":"'8.1 - INF_BLOWER DOOR TEST'!K33","v":0}]
[null,null,"8.3.3","Preliminary Testing (Recommended)","NA","NA","NA","NA","NA",{"$f":"'8.1 - INF_BLOWER DOOR TEST'!L34","v":0},"NA",{"$f":"'8.1 - INF_BLOWER DOOR TEST'!K34","v":0}]
[null,null,"8.3.4","Final Verification Testing","NA","NA","NA","NA","NA",{"$f":"'8.1 - INF_BLOWER DOOR TEST'!L35","v":0},"NA",{"$f":"'8.1 - INF_BLOWER DOOR TEST'!K35","v":0}]
[null,null,"8.3.5","Fan Pressure Testing Method","NA","NA","NA","NA","NA",{"$f":"'8.1 - INF_BLOWER DOOR TEST'!L36","v":0},"NA",{"$f":"'8.1 - INF_BLOWER DOOR TEST'!K36","v":0}]
[null,null,8.5,"VENTILATION"]
[null,null,"8.5.1","Ventilation - Notes for Drawings and Specifications","NA","NA",{"$f":"'8.2 - VENT_SCHEDULE&TAB REPORT'!$H$33","v":0},{"$f":"'8.2 - VENT_SCHEDULE&TAB REPORT'!$O$33","v":0},{"$f":"'8.2 - VENT_SCHEDULE&TAB REPORT'!$P$33","v":0},"NA","NA","NA"]
[null,null,"8.5.2","Ventilation Prescriptive Path - Notes for Drawings and Specifications","NA","NA",{"$f":"'8.2 - VENT_SCHEDULE&TAB REPORT'!$H$34","v":0},{"$f":"'8.2 - VENT_SCHEDULE&TAB REPORT'!$O$34","v":0},{"$f":"'8.2 - VENT_SCHEDULE&TAB REPORT'!$P$34","v":0},"NA","NA","NA"]
[null,null,"8.5.3","Garage Ventilation - Notes for Drawings and Specifications","NA","NA",{"$f":"'8.2 - VENT_SCHEDULE&TAB REPORT'!$H$35","v":0},{"$f":"'8.2 - VENT_SCHEDULE&TAB REPORT'!$O$35","v":0},{"$f":"'8.2 - VENT_SCHEDULE&TAB REPORT'!$P$35","v":0},"NA","NA","NA"]
[null,null,null,"COMPLIANCE STATEMENT"]
[null,null,"8.6.1","Compliance Statement","NA","NA",{"$f":"'8.2 - VENT_SCHEDULE&TAB REPORT'!H50","v":0},{"$f":"'8.2 - VENT_SCHEDULE&TAB REPORT'!O50","v":0},{"$f":"'8.2 - VENT_SCHEDULE&TAB REPORT'!P50","v":0},{"$f":"'8.2 - VENT_SCHEDULE&TAB REPORT'!R50","v":0},{"$f":"'8.2 - VENT_SCHEDULE&TAB REPORT'!O50","v":0},{"$f":"'8.2 - VENT_SCHEDULE&TAB REPORT'!Q50","v":0}]
[null,null,null,"MODELING INPUTS - SIZING AND BALANCING"]
[null,null,"8.6.2","Non - Apartment Fan Efficiency",{"$f":"'8.2 - VENT_SCHEDULE&TAB REPORT'!F52","v":0},{"$f":"'8.2 - VENT_SCHEDULE&TAB REPORT'!G52","v":0},{"$f":"'8.2 - VENT_SCHEDULE&TAB REPORT'!H52","v":0},{"$f":"'8.2 - VENT_SCHEDULE&TAB REPORT'!O52","v":0},{"$f":"'8.2 - VENT_SCHEDULE&TAB REPORT'!P52","v":0},{"$f":"'8.2 - VENT_SCHEDULE&TAB REPORT'!R52","v":0},{"$f":"'8.2 - VENT_SCHEDULE&TAB REPORT'!O52","v":0},{"$f":"'8.2 - VENT_SCHEDULE&TAB REPORT'!Q52","v":0}]
[null,null,"8.6.3","Apartment Fan Efficiency (Roof)",{"$f":"'8.2 - VENT_SCHEDULE&TAB REPORT'!F53","v":0},{"$f":"'8.2 - VENT_SCHEDULE&TAB REPORT'!G53","v":0},{"$f":"'8.2 - VENT_SCHEDULE&TAB REPORT'!H53","v":0},{"$f":"'8.2 - VENT_SCHEDULE&TAB REPORT'!O53","v":0},{"$f":"'8.2 - VENT_SCHEDULE&TAB REPORT'!P53","v":0},{"$f":"'8.2 - VENT_SCHEDULE&TAB REPORT'!R53","v":0},{"$f":"'8.2 - VENT_SCHEDULE&TAB REPORT'!O53","v":0},{"$f":"'8.2 - VENT_SCHEDULE&TAB REPORT'!Q53","v":0}]
[null,null,"8.6.4","Apartment Fan Efficiency (In-Unit)",{"$f":"'8.2 - VENT_SCHEDULE&TAB REPORT'!F54","v":0},{"$f":"'8.2 - VENT_SCHEDULE&TAB REPORT'!G54","v":0},{"$f":"'8.2 - VENT_SCHEDULE&TAB REPORT'!H54","v":0},{"$f":"'8.2 - VENT_SCHEDULE&TAB REPORT'!O54","v":0},{"$f":"'8.2 - VENT_SCHEDULE&TAB REPORT'!P54","v":0},{"$f":"'8.2 - VENT_SCHEDULE&TAB REPORT'!R54","v":0},{"$f":"'8.2 - VENT_SCHEDULE&TAB REPORT'!O54","v":0},{"$f":"'8.2 - VENT_SCHEDULE&TAB REPORT'!Q54","v":0}]
[null,null,"8.6.5","All Ventilation Systems - Capacity, Testing and Balancing",{"$f":"'8.2 - VENT_SCHEDULE&TAB REPORT'!F56","v":0},{"$f":"'8.2 - VENT_SCHEDULE&TAB REPORT'!G56","v":0},{"$f":"'8.2 - VENT_SCHEDULE&TAB REPORT'!H56","v":0},{"$f":"'8.2 - VENT_SCHEDULE&TAB REPORT'!O56","v":0},{"$f":"'8.2 - VENT_SCHEDULE&TAB REPORT'!P56","v":0},{"$f":"'8.2 - VENT_SCHEDULE&TAB REPORT'!R56","v":0},{"$f":"'8.2 - VENT_SCHEDULE&TAB REPORT'!O56","v":0},{"$f":"'8.2 - VENT_SCHEDULE&TAB REPORT'!Q56","v":0}]
[null,null,"8.6.6","Demand Controls",{"$f":"'8.2 - VENT_SCHEDULE&TAB REPORT'!F57","v":0},{"$f":"'8.2 - VENT_SCHEDULE&TAB REPORT'!G57","v":0},{"$f":"'8.2 - VENT_SCHEDULE&TAB REPORT'!H57","v":0},{"$f":"'8.2 - VENT_SCHEDULE&TAB REPORT'!O57","v":0},{"$f":"'8.2 - VENT_SCHEDULE&TAB REPORT'!P57","v":0},{"$f":"'8.2 - VENT_SCHEDULE&TAB REPORT'!R57","v":0},{"$f":"'8.2 - VENT_SCHEDULE&TAB REPORT'!O57","v":0},{"$f":"'8.2 - VENT_SCHEDULE&TAB REPORT'!Q57","v":0}]
[null,null,"8.6.7","Heat Recovery",{"$f":"'8.2 - VENT_SCHEDULE&TAB REPORT'!F58","v":0},{"$f":"'8.2 - VENT_SCHEDULE&TAB REPORT'!G58","v":0},{"$f":"'8.2 - VENT_SCHEDULE&TAB REPORT'!H58","v":0},{"$f":"'8.2 - VENT_SCHEDULE&TAB REPORT'!O58","v":0},{"$f":"'8.2 - VENT_SCHEDULE&TAB REPORT'!P58","v":0},{"$f":"'8.2 - VENT_SCHEDULE&TAB REPORT'!R58","v":0},{"$f":"'8.2 - VENT_SCHEDULE&TAB REPORT'!O58","v":0},{"$f":"'8.2 - VENT_SCHEDULE&TAB REPORT'!Q58","v":0}]
[null,null,null,"GARAGE VENTILATION"]
[null,null,"8.7.1","Garage Exhaust Fan CFM and Efficiency",{"$f":"'8.2 - VENT_SCHEDULE&TAB REPORT'!F60","v":0},{"$f":"'8.2 - VENT_SCHEDULE&TAB REPORT'!G60","v":0},{"$f":"'8.2 - VENT_SCHEDULE&TAB REPORT'!H60","v":0},{"$f":"'8.2 - VENT_SCHEDULE&TAB REPORT'!O60","v":0},{"$f":"'8.2 - VENT_SCHEDULE&TAB REPORT'!P60","v":0},{"$f":"'8.2 - VENT_SCHEDULE&TAB REPORT'!R60","v":0},{"$f":"'8.2 - VENT_SCHEDULE&TAB REPORT'!O60","v":0},{"$f":"'8.2 - VENT_SCHEDULE&TAB REPORT'!Q60","v":0}]
[null,null,"8.7.2","Test Sensor Operation","NA","NA",{"$f":"'8.2 - VENT_SCHEDULE&TAB REPORT'!H61","v":0},{"$f":"'8.2 - VENT_SCHEDULE&TAB REPORT'!O61","v":0},{"$f":"'8.2 - VENT_SCHEDULE&TAB REPORT'!P61","v":0},{"$f":"'8.2 - VENT_SCHEDULE&TAB REPORT'!R61","v":0},{"$f":"'8.2 - VENT_SCHEDULE&TAB REPORT'!O61","v":0},{"$f":"'8.2 - VENT_SCHEDULE&TAB REPORT'!Q61","v":0}]
[null,null,"8.7.3","CO Sensor Locations","NA","NA",{"$f":"'8.2 - VENT_SCHEDULE&TAB REPORT'!H62","v":0},{"$f":"'8.2 - VENT_SCHEDULE&TAB REPORT'!O62","v":0},{"$f":"'8.2 - VENT_SCHEDULE&TAB REPORT'!P62","v":0},{"$f":"'8.2 - VENT_SCHEDULE&TAB REPORT'!R62","v":0},{"$f":"'8.2 - VENT_SCHEDULE&TAB REPORT'!O62","v":0},{"$f":"'8.2 - VENT_SCHEDULE&TAB REPORT'!Q62","v":0}]
[null,null,"8.7.4","Garage Fan and CO Sensor - Manufacturer's Product Data","NA","NA",{"$f":"'8.2 - VENT_SCHEDULE&TAB REPORT'!H63","v":0},{"$f":"'8.2 - VENT_SCHEDULE&TAB REPORT'!O63","v":0},{"$f":"'8.2 - VENT_SCHEDULE&TAB REPORT'!P63","v":0},{"$f":"'8.2 - VENT_SCHEDULE&TAB REPORT'!R63","v":0},{"$f":"'8.2 - VENT_SCHEDULE&TAB REPORT'!O63","v":0},{"$f":"'8.2 - VENT_SCHEDULE&TAB REPORT'!Q63","v":0}]
[null,null,null,"VENTILATION MISC"]
[null,null,"8.8.1","Toilet, Kitchen, General Exhaust Grilles and Corridor Supply Ventilation Grilles","NA","NA",{"$f":"'8.2 - VENT_SCHEDULE&TAB REPORT'!H65","v":0},{"$f":"'8.2 - VENT_SCHEDULE&TAB REPORT'!O65","v":0},{"$f":"'8.2 - VENT_SCHEDULE&TAB REPORT'!P65","v":0},{"$f":"'8.2 - VENT_SCHEDULE&TAB REPORT'!R65","v":0},{"$f":"'8.2 - VENT_SCHEDULE&TAB REPORT'!O65","v":0},{"$f":"'8.2 - VENT_SCHEDULE&TAB REPORT'!Q65","v":0}]
[null,null,"8.8.2","Common Area Supply Ventilation - Outdoor Air Damper","NA","NA",{"$f":"'8.2 - VENT_SCHEDULE&TAB REPORT'!H66","v":0},{"$f":"'8.2 - VENT_SCHEDULE&TAB REPORT'!O66","v":0},{"$f":"'8.2 - VENT_SCHEDULE&TAB REPORT'!P66","v":0},{"$f":"'8.2 - VENT_SCHEDULE&TAB REPORT'!R66","v":0},{"$f":"'8.2 - VENT_SCHEDULE&TAB REPORT'!O66","v":0},{"$f":"'8.2 - VENT_SCHEDULE&TAB REPORT'!Q66","v":0}]
[null,null,"8.8.3","Fresh Air Intake Systems - Operating Sequence","NA","NA",{"$f":"'8.2 - VENT_SCHEDULE&TAB REPORT'!H67","v":0},{"$f":"'8.2 - VENT_SCHEDULE&TAB REPORT'!O67","v":0},{"$f":"'8.2 - VENT_SCHEDULE&TAB REPORT'!P67","v":0},{"$f":"'8.2 - VENT_SCHEDULE&TAB REPORT'!R67","v":0},{"$f":"'8.2 - VENT_SCHEDULE&TAB REPORT'!O67","v":0},{"$f":"'8.2 - VENT_SCHEDULE&TAB REPORT'!Q67","v":0}]
[null,null,"8.8.4","Fresh Air Intakes are Properly Located","NA","NA",{"$f":"'8.2 - VENT_SCHEDULE&TAB REPORT'!H68","v":0},{"$f":"'8.2 - VENT_SCHEDULE&TAB REPORT'!O68","v":0},{"$f":"'8.2 - VENT_SCHEDULE&TAB REPORT'!P68","v":0},{"$f":"'8.2 - VENT_SCHEDULE&TAB REPORT'!R68","v":0},{"$f":"'8.2 - VENT_SCHEDULE&TAB REPORT'!O68","v":0},{"$f":"'8.2 - VENT_SCHEDULE&TAB REPORT'!Q68","v":0}]
[null,null,"8.8.5","Smoke Vents","NA","NA",{"$f":"'8.2 - VENT_SCHEDULE&TAB REPORT'!H69","v":0},{"$f":"'8.2 - VENT_SCHEDULE&TAB REPORT'!O69","v":0},{"$f":"'8.2 - VENT_SCHEDULE&TAB REPORT'!P69","v":0},{"$f":"'8.2 - VENT_SCHEDULE&TAB REPORT'!R69","v":0},{"$f":"'8.2 - VENT_SCHEDULE&TAB REPORT'!O69","v":0},{"$f":"'8.2 - VENT_SCHEDULE&TAB REPORT'!Q69","v":0}]
[null,null,"8.8.6","Passive Intake Systems (Trickle Vents)","NA","NA","NA","NA","NA",{"$f":"'8.2 - VENT_SCHEDULE&TAB REPORT'!R70","v":0},"NA",{"$f":"'8.2 - VENT_SCHEDULE&TAB REPORT'!Q70","v":0}]
[null,null,"8.8.7","Ventilation - Manufacturer's Product Data","NA","NA","NA","NA","NA",{"$f":"'8.2 - VENT_SCHEDULE&TAB REPORT'!R71","v":0},"NA",{"$f":"'8.2 - VENT_SCHEDULE&TAB REPORT'!Q71","v":0}]
[null,null,"8.8.8","Ventilation - Training and Manuals","NA","NA","NA","NA","NA",{"$f":"'8.2 - VENT_SCHEDULE&TAB REPORT'!R72","v":0},"NA",{"$f":"'8.2 - VENT_SCHEDULE&TAB REPORT'!Q72","v":0}]
[null,null,null,"DUCT TIGHTNESS"]
[null,null,"8.9.1","Duct Tightness - Notes for Drawings and Specifications","NA","NA",{"$f":"'8.2 - VENT_DUCT TIGHTNESS'!$F$30","v":0},{"$f":"'8.2 - VENT_DUCT TIGHTNESS'!$G$30","v":0},{"$f":"'8.2 - VENT_DUCT TIGHTNESS'!$H$30","v":0},"NA","NA","NA"]
[null,null,"8.9.2","Duct Tightness - Compliance Statement",{"$f":"'8.2 - VENT_DUCT TIGHTNESS'!D32","v":0},{"$f":"'8.2 - VENT_DUCT TIGHTNESS'!E32","v":0},{"$f":"'8.2 - VENT_DUCT TIGHTNESS'!F32","v":0},{"$f":"'8.2 - VENT_DUCT TIGHTNESS'!G32","v":0},{"$f":"'8.2 - VENT_DUCT TIGHTNESS'!H32","v":0},{"$f":"'8.2 - VENT_DUCT TIGHTNESS'!J32","v":0},{"$f":"'8.2 - VENT_DUCT TIGHTNESS'!G32","v":0},{"$f":"'8.2 - VENT_DUCT TIGHTNESS'!I32","v":0}]
[null,null,"8.9.3","Duct Tightness - Roof Curbs",{"$f":"'8.2 - VENT_DUCT TIGHTNESS'!D32","v":0},{"$f":"'8.2 - VENT_DUCT TIGHTNESS'!E32","v":0},{"$f":"'8.2 - VENT_DUCT TIGHTNESS'!F33","v":0},{"$f":"'8.2 - VENT_DUCT TIGHTNESS'!G33","v":0},{"$f":"'8.2 - VENT_DUCT TIGHTNESS'!H33","v":0},{"$f":"'8.2 - VENT_DUCT TIGHTNESS'!J33","v":0},{"$f":"'8.2 - VENT_DUCT TIGHTNESS'!G33","v":0},{"$f":"'8.2 - VENT_DUCT TIGHTNESS'!I33","v":0}]
[null,null,"8.9.4","Duct Leakage Testing - Central Exhaust Systems Serving Apartments","NA","NA","NA","NA","NA",{"$f":"'8.2 - VENT_DUCT TIGHTNESS'!J34","v":0},"NA",{"$f":"'8.2 - VENT_DUCT TIGHTNESS'!I34","v":0}]
[null,null,"8.9.5","Roof Curb (Central)","NA","NA","NA","NA","NA",{"$f":"'8.2 - VENT_DUCT TIGHTNESS'!J35","v":0},"NA",{"$f":"'8.2 - VENT_DUCT TIGHTNESS'!I35","v":0}]
[null,null,"8.9.6","Transverse Joints (Central and Through Wall)","NA","NA","NA","NA","NA",{"$f":"'8.2 - VENT_DUCT TIGHTNESS'!J36","v":0},"NA",{"$f":"'8.2 - VENT_DUCT TIGHTNESS'!I36","v":0}]
[null,null,"8.9.7","Transitions (Central and Through Wall)","NA","NA","NA","NA","NA",{"$f":"'8.2 - VENT_DUCT TIGHTNESS'!J37","v":0},"NA",{"$f":"'8.2 - VENT_DUCT TIGHTNESS'!I37","v":0}]
[null,null,"8.9.8","Pinned Ducts  (Central and Through Wall)","NA","NA","NA","NA","NA",{"$f":"'8.2 - VENT_DUCT TIGHTNESS'!J38","v":0},"NA",{"$f":"'8.2 - VENT_DUCT TIGHTNESS'!I38","v":0}]
[null,null,"8.9.9","Elbow Joints (Round Duct Work)","NA","NA","NA","NA","NA",{"$f":"'8.2 - VENT_DUCT TIGHTNESS'!J39","v":0},"NA",{"$f":"'8.2 - VENT_DUCT TIGHTNESS'!I39","v":0}]
[null,null,"8.9.10","Exterior Wall Connection  (Through Wall)","NA","NA","NA","NA","NA",{"$f":"'8.2 - VENT_DUCT TIGHTNESS'!J40","v":0},"NA",{"$f":"'8.2 - VENT_DUCT TIGHTNESS'!I40","v":0}]
[null,null,9,"METERS"]
[null,null,"9.1.1","Location - Residential","NA","NA",{"$f":"'9.1 - METERS'!I28","v":0},{"$f":"'9.1 - METERS'!J28","v":0},{"$f":"'9.1 - METERS'!K28","v":0},{"$f":"'9.1 - METERS'!M28","v":0},{"$f":"'9.1 - METERS'!J28","v":0},{"$f":"'9.1 - METERS'!L28","v":0}]
[null,null,"9.1.2","Location - Non Residential","NA","NA",{"$f":"'9.1 - METERS'!I29","v":0},{"$f":"'9.1 - METERS'!J29","v":0},{"$f":"'9.1 - METERS'!K29","v":0},{"$f":"'9.1 - METERS'!M29","v":0},{"$f":"'9.1 - METERS'!J29","v":0},{"$f":"'9.1 - METERS'!L29","v":0}]
[null,null,"9.1.3","Type","NA","NA","NA","NA","NA",{"$f":"'9.1 - METERS'!M30","v":0},"NA",{"$f":"'9.1 - METERS'!L30","v":0}]
[null,null,"9.1.4","Configuration","NA","NA","NA","NA","NA",{"$f":"'9.1 - METERS'!M31","v":0},"NA",{"$f":"'9.1 - METERS'!L31","v":0}]
[null,null,"9.1.5","Utility Release Forms","NA","NA","NA","NA","NA",{"$f":"'9.1 - METERS'!M32","v":0},"NA",{"$f":"'9.1 - METERS'!L32","v":0}]
[null,null,"9.1.6","Statement of Substantial Completion","NA","NA","NA","NA","NA",{"$f":"'9.1 - METERS'!M33","v":0},"NA",{"$f":"'9.1 - METERS'!L33","v":0}]

{"sheet":"1.1 - APPLIANCES","index":9,"n_rows":38,"n_cols":21,"rows_kept":38,"cut":false,"hidden":false,"merged":[[4,6,4,12],[24,15,24,16],[27,15,27,16],[7,1,7,11],[25,1,29,1],[29,15,29,16],[28,15,28,16],[31,1,31,3],[8,1,8,11],[23,1,23,5],[25,2,29,2],[25,15,25,16],[26,15,26,16],[30,6,30,11],[30,15,30,16],[31,6,31,11],[31,15,31,16],[32,1,32,3],[33,15,33,16],[33,1,33,13],[32,6,32,11],[32,15,32,16]]}
[null,null,"ENERGY STAR"]
[null,null,"MULTIFAMILY HIGH RISE PROGRAM"]
[null,null,"Project Name: ",{"$f":"'Project Info'!C3","v":0}]
[]
[null,"APPLIANCES - PROTOCOL 1.1",null,null,null,null,null,null,null,null,null,null,null,null,null,"Date:","Field Verified By:"]
[]
[null,"Schedule:"]
[null,"1) The developer or GC shall ensure that deliveries are inspected prior to accepting them to verify that product substitutions by the distributor or manufacturer have not resulted in non-ENERGY STAR certified appliances."]
[null,"2) Minimum of one on-site inspection required, preferably immediately after installation so that corrective action can be taken if necessary.  Delivery tickets may be used to verify complete shipments but on-site inspections of a sample of installed appliances is required.\n"]
[]
[null,"Equipment Needed"]
[null,"1) Camera"]
[null,"2) Installation Schedule"]
[null,"3) Floor Plans"]
[]
[null,"Sampling Requirements:"]
[null,"1) For spaces containing appliances, follow the modified RESNET sampling protocol outlined in the How to Use this Manual section of the Testing and Verification Protocols."]
[null,"2) For buildings with common laundry rooms, RESNET sampling protocols are modified to require inspection of all the clothes washers in at least one (1) laundry room. "]
[null,"3) *PHOTOS REQUIRED*"]
[null,"- Photograph one (1) representative appliance faceplate of each type of appliance being inspected.  "]
[null,"- Photograph ENERGY STAR label or nameplate displaying model number and/or attach cut sheet."]
[]
[null,"NOTES FOR DRAWINGS AND SPECIFICATIONS"]
[null,"• Include a schedule with location and quantity.\n• Require ENERGY STAR certified products and appliances (confirm online)."]
[null,null,"PATH REQUIREMENT",null,"PROPOSED \nERM","ENERGY \nMODEL","MFR","MODEL #","QUANTITY","LOCATION","ENERGY STAR\n(Yes/No)","PLAN REVIEW COMMENTS","LOCATION\n(dwg/spec)","PLAN REVIEW","INSPECTION","INSPECTION COMMENTS \n(Use this field to note problems, specific inspection details, or changes in As-Built compared to Design, like model numbers. If installed as designed, please state “Same as Design”. If make/model numbers have changed, list them here.)"]
[null,"Compliance Statement\n• ENERGY STAR certification must be confirmed on the ENERGY STAR website.\n• All refrigerators, dishwashers and clothes washers are consistent with the project specifications and Proposed Design model or meets or exceeds the requirements listed in the Prescriptive Path.\n\nNote: Kitchen range hoods are not required to be ENERGY STAR certified.",{"$f":"IF('Project Info'!C4='Project Info'!P35,'Prescriptive Path Checklist'!C12,IF('Project Info'!C4='Project Info'!P36,'Prerequisites Checklist'!C12,\"<Select compliance path on the 'Project Info' tab>\"))","v":"<Select compliance path on the 'Project Info' tab>"},"Refrigerators",{"$f":"ERMs!C12","v":0},{"$f":"ERMs!D12","v":0}]
[null,null,null,"Dishwashers",{"$f":"ERMs!C13","v":0},{"$f":"ERMs!D13","v":0}]
[null,null,null,"Clothes Washers",{"$f":"ERMs!C14","v":0},{"$f":"ERMs!D14","v":0}]
[null,null,null,"Ceiling fans",{"$f":"ERMs!C15","v":0},{"$f":"ERMs!D15","v":0}]
[null,null,null,"Vending Machines",{"$f":"ERMs!C16","v":0},{"$f":"ERMs!D16","v":0}]
[null,"PROTOCOL",null,null,"PROPOSED \nERM","ENERGY \nMODEL","PLAN REVIEW COMMENTS",null,null,null,null,null,"LOCATION\n(dwg/spec)","PLAN REVIEW","INSPECTION","INSPECTION COMMENTS \n(Use this field to note problems, specific inspection details, or changes in As-Built compared to Design, like model numbers. If installed as designed, please state “Same as Design”. If make/model numbers have changed, list them here.)"]
[null,"Stoves\n• Electric or Gas",null,null,{"$f":"ERMs!C17","v":"Enter Fuel"},{"$f":"ERMs!D17","v":0}]
[null,"Dryers\n• Electric or Gas",null,null,{"$f":"ERMs!C18","v":"Enter Fuel"},{"$f":"ERMs!D18","v":0}]
[null,"Statement of Substantial Completion\n• A Statement of Substantial Completion or approved proxy may be used to establish completion of the work associated with this protocol. A Statement of Substantial Completion is to be completed by the installation contractor or other qualified representative on company letterhead, complete with all information, photographs, cut sheets, etc., required in this protocol and in the corresponding T&V Worksheet."]
[]
[null,null,null,null,null,null,null,null,null,null,null,null,null,null,null,null,null,null,null,null,"Yes"]
[null,null,null,null,null,null,null,null,null,null,null,null,null,null,null,null,null,null,null,null,"No"]
[null,null,null,null,null,null,null,null,null,null,null,null,null,null,null,null,null,null,null,null,"N/A"]

{"sheet":"2.1-2.2 - DOMESTIC HOT WATER","index":10,"n_rows":63,"n_cols":22,"rows_kept":63,"cut":false,"hidden":false,"merged":[[55,1,55,13],[56,1,56,13],[53,1,53,6],[53,7,53,11],[54,1,54,6],[54,7,54,11],[50,1,50,15],[51,1,51,6],[51,7,51,11],[52,1,52,6],[52,7,52,11],[48,1,48,2],[48,3,48,4],[48,7,48,11],[49,1,49,2],[49,3,49,4],[49,7,49,11],[47,1,47,2],[47,3,47,4],[47,7,47,11],[45,1,45,2],[45,3,45,4],[45,7,45,11],[46,1,46,15],[44,7,44,11],[12,1,12,4],[12,8,12,9],[12,10,12,11],[12,12,12,13],[19,1,19,9],[20,1,20,9],[21,1,21,9],[22,1,22,9],[24,1,24,10],[12,14,12,15],[13,8,13,9],[13,10,13,11],[10,1,10,9],[10,10,10,11],[10,12,10,13],[10,14,10,15],[11,1,11,9],[11,10,11,11],[11,12,11,13],[11,14,11,15],[8,1,8,9],[8,10,8,11],[8,12,8,13],[8,14,8,15],[9,1,9,9],[9,10,9,11],[9,12,9,13],[9,14,9,15],[7,1,7,9],[7,10,7,11],[7,12,7,13],[7,14,7,15],[4,12,4,13],[4,14,4,15],[5,1,5,4],[5,8,5,9],[5,10,5,11],[5,12,5,13],[5,14,5,15],[6,1,6,4],[6,8,6,9],[6,10,6,11],[6,12,6,13],[6,14,6,15]]}
[null,null,"ENERGY STAR"]
[null,null,"MULTIFAMILY HIGH RISE PROGRAM"]
[null,null,"Project Name: ",{"$f":"'Project Info'!C3","v":0}]
[]
[null,"HVAC - DHW SYSTEMS - PROTOCOL 2.1, 2.2",null,null,null,null,null,null,null,null,null,null,"Date:",null,"Field Verified By:"]
[]
[null,"Schedule:"]
[null,"1) The quality assurance and verification procedures occur during the pre-construction, construction, and post-construction phases of system installation.  Refer to the appropriate standards (eg. NFPA) to determine exact timing of inspections."]
[null,"2) Commissioning of the system occurs during pre-construction and construction phases of installation. Inspection, testing, and final commissioning are conducted during the turn over/accpetance phase of the installation of the system."]
[null,"3) Training shall occur following installation of the system and completion of all quality assurance and verification procedures.  \n"]
[null,"4) The developer or GC shall ensure that deliveries are inspected prior to accepting them to verify that product substitutions by the distributor or manufacturer have not resulted in plumbing fixtures with higher flow rates than those in the Proposed Design or required by the Prescriptive Path."]
[null,"5) Minimum of one (1) on-site inspection required, preferably immediately after installation so that corrective action can be taken if necessary.  Delivery tickets may be used to verify complete shipments but on-site inspections of a sample of installed plumbing fixtures is required.\n"]
[]
[null,"Equipment Needed"]
[null,"1) Mechanical Schedule and Floor Plans"]
[null,"2) Camera"]
[]
[null,"Sampling Requirements:"]
[null,"1)  100% of centralized primary equipment (i.e. DHW plants) shall be inspected in the quality assurance and verification process.  "]
[null,"2)  Individual spaces or apartments containing electric or fossil-fuel DHW systems shall be inspected and tested following the modified RESNET sampling protocol outlined in the How to Use this Manual section on page 11 of the T&V Protocols, including at least one of each unique type. "]
[null,"3)  Spaces containing plumbing fixtures must be inspected following the modified RESNET sampling protocol outlined in the How to Use this Manual section on page 11 of the T&V Protocols, including at least one of each unique fixture. "]
[null,"4)  All spaces with Domestic Hot Water service (i.e. bathrooms, kitchens, etc.) shall be tested for hot water delivery temperature following the modified RESNET sampling protocol outlined in the How to Use this Manual section on page 11 of the T&V Protocols, with the additional requirement that, for each central DHW system, the spaces sampled must include the first space supplied by the system and the last space supplied by the longest run of the system."]
[]
[null,"5) *PHOTOS REQUIRED* "]
[null,"-Provide photos of the domestic hot water system and faceplates to verify proper installation and compliance with proposed design.\n-Photograph one (1) representative fixture of each type of plumbing fixture being inspected."]
[null,"ID -DHW System and Low-Flow Fixtures","DESCRIPTION","LOCATION","QUANTITY","MFR","MODEL #","CAPACITY (BTU/H, gallons or kW)","AHRI CERT #","EFFICIENCY\n(% Et or EF)","GPM/\nGPF","ENERGY STAR/\nWater\nSense","LOCATION\n(dwg/spec)","PLAN REVIEW","INSPECTION","INSPECTION COMMENTS \n(Use this field to note problems, specific inspection details, or changes in As-Built compared to Design, like model numbers. If installed as designed, please state “Same as Design”. If make/model numbers have changed, list them here.)"]
[]
[]
[]
[]
[]
[]
[]
[]
[]
[]
[]
[]
[]
[]
[]
[]
[]
[]
[null,"PROTOCOL",null,"PATH REQUIREMENT",null,"PROPOSED \nERM","ENERGY \nMODEL","PLAN REVIEW COMMENTS",null,null,null,null,"LOCATION\n(dwg/spec)","PLAN REVIEW","INSPECTION","INSPECTION COMMENTS \n(Use this field to note problems, specific inspection details, or changes in As-Built compared to Design, like model numbers. If installed as designed, please state “Same as Design”. If make/model numbers have changed, list them here.)"]
[null,"Compliance Statement\n• All DHW systems are consistent with the project specifications and Proposed Design model or meets or exceeds the requirements listed in the Prescriptive Path.",null,{"$f":"IF('Project Info'!C4='Project Info'!P35,\"DHW\" & 'Prescriptive Path Checklist'!C19,IF('Project Info'!C4='Project Info'!P36,\"DHW \"&'Prerequisites Checklist'!C19,\"<Select compliance path on the 'Project Info' tab>\"))","v":"<Select compliance path on the 'Project Info' tab>"},null,"See below","See below"]
[null,"MODELING INPUTS"]
[null,"DHW - Type & Efficiency\n• Provide Proposed DHW system type, efficiency, capacity, fuel; include number, efficiency and HP of pumps, and whether VFD is specified in the MOTOR section.\n• DHW equipment efficiency must be verified through AHRI ratings. If not available, OEM-provided performance data must be used, in compliance with ASHRAE 90.1-2007, Section 6.4.1.4.",null,{"$f":"IF('Project Info'!C4='Project Info'!P35,'Prescriptive Path Checklist'!C20,IF('Project Info'!C4='Project Info'!P36,'Prerequisites Checklist'!C20,\"<Select compliance path on the 'Project Info' tab>\"))","v":"<Select compliance path on the 'Project Info' tab>"},null,{"$f":"ERMs!C20","v":0},{"$f":"ERMs!D20","v":0}]
[null,"DHW - Storage Capacity\n• Storage tank capacity must be reviewed and verified that it was sized based on occupancy.\n",null,{"$f":"IF('Project Info'!C4='Project Info'!P35,'Prescriptive Path Checklist'!C21,IF('Project Info'!C4='Project Info'!P36,'Prerequisites Checklist'!C21,\"<Select compliance path on the 'Project Info' tab>\"))","v":"<Select compliance path on the 'Project Info' tab>"},null,{"$f":"ERMs!C21","v":0},{"$f":"ERMs!D21","v":0}]
[null,"DHW - Low Flow fixtures\n• Plumbing fixture flow rates for all showerheads, bath faucets and kitchen faucets match assumptions made in the Proposed Design model or the inputs have been adjusted accordingly. As an alternative to the Performance Path, projects must ensure that all of the requirements listed in the Prescriptive Path have been met or exceeded.\n• A schedule showing plumbing fixtures with GPM, location, WaterSense certification, and quantity has been included in the construction documents.",null,{"$f":"IF('Project Info'!C4='Project Info'!P35,'Prescriptive Path Checklist'!C25,IF('Project Info'!C4='Project Info'!P36,'Prerequisites Checklist'!C25,\"<Select compliance path on the 'Project Info' tab>\"))","v":"<Select compliance path on the 'Project Info' tab>"},null,{"$f":"ERMs!C22","v":0},{"$f":"ERMs!D22","v":0}]
[null,"DHW CONFIGURATION, CONTROLS, DISTRIBUTION & DOCUMENTATION"]
[null,"DHW Central Plant - Boiler room location and venting\n• Verify location of domestic hot water systems (e.g., cellar or roof), combustion air venting configuration (e.g., combustion air piped to boilers, boiler room air used for combustion), and venting configuration (e.g., inducer fan specified and sequence of operation verified, if required)."]
[null,"DHW - Insulation for Piping\n•Piping carrying liquid with temperatures greater than 105°F must have a minimum of 1” of insulation. Pipes 1.5” in diameter and greater must have a minimum of 1.5” of insulation.  Construction documents must account for piping total thickness including required insulation when passing through planks or any other penetrations. Construction documents shall specify that the piping must be inspected before access is covered up. Extent and location to be determined by ASHRAE 90.1-2007 Section 7.4.3 or local code. "]
[null,"DHW - Temperature\n• The temperature setting of in-unit storage water heaters must not exceed 140F. For both in-unit and central DHW systems, temperatures measured at faucets and showerheads must not exceed 125F."]
[null,"DHW - Controls\n• If specified, verify  electronic mixing valve is used to control hot water temperature for central domestic water heating systems. Mixing valves shall be located between the DHW heating plant and DHW supply to the building.  Mechanical valves shall not be specified. Verify mixing valve temperature set point."]
[null,"DHW - Training and Manuals\n• EPA recommends confirming that all applicable operating and specification manuals are delivered to the building staff. EPA also recommends verifying that staff members have been trained and are aware of their responsibilities to maintain and operate the systems properly. Summarize any training performed and personnel involved."]
[null,"DHW - Manufacturer's Product Data\n• Review manufacturer’s cut sheets or invoice detailing system manufacturer, model, size, and location, and keep with the building file. DHW equipment efficiency must be verified through AHRI ratings. If not available, OEM-provided performance data must be used, in compliance with ASHRAE 90.1-2007, Section 6.4.1.4. If following the Prescriptive Path and ENERGY STAR certification is required, it must be verified through the ENERGY STAR website."]
[]
[]
[]
[null,null,null,null,null,null,null,null,null,null,null,null,null,null,null,null,null,null,null,null,null,"Yes"]
[null,null,null,null,null,null,null,null,null,null,null,null,null,null,null,null,null,null,null,null,null,"No"]
[null,null,null,null,null,null,null,null,null,null,null,null,null,null,null,null,null,null,null,null,null,"N/A"]

{"sheet":"3.1 - ENV_BELOW GRADE WALLS","index":11,"n_rows":55,"n_cols":18,"rows_kept":55,"cut":false,"hidden":false,"merged":[[52,1,52,9],[51,1,51,7],[26,1,26,4],[19,1,19,9],[47,3,47,4],[49,1,49,2],[28,6,34,6],[36,6,42,6],[49,3,49,4],[50,1,50,4],[48,1,48,4],[24,1,24,3],[27,1,27,4],[43,1,43,2],[44,1,44,2],[23,1,23,6],[11,11,13,13],[4,7,4,8],[10,1,10,6],[8,1,8,6],[22,1,22,6],[7,7,7,8],[9,1,9,6],[5,7,5,8],[6,7,6,8],[21,1,21,9],[20,1,20,9]]}
[null,null,"ENERGY STAR"]
[null,null,"MULTIFAMILY HIGH RISE PROGRAM"]
[null,null,"Project Name: ",{"$f":"'Project Info'!C3","v":0}]
[]
[null,"ENVELOPE - BELOW GRADE WALLS - PROTOCOL 3.1",null,null,null,null,null,"Date:",null,"Field Verified By:"]
[]
[]
[null,"Schedule:"]
[null,"1) Inspections must take place during construction:  before pouring slab, before back-filling foundation walls, at framing (pre-insulation), post-insulation and pre-drywall, and post-completion."]
[null,"2) Inspections of interior and cavity insulation must take place during construction:  at framing pre-insulation, post-insulation and pre-drywall, and post-completion."]
[null,"3) Inspections of exterior insulation, air, vapor, and weather barrier systems must be completed prior to enclosure.\n"]
[null,null,null,null,null,null,null,null,null,null,null,"Please find below some typical thermal resistance R-values for most common insulation materials. Note that these numbers are for reference only; and when available thermal perfomance R-value provided in the the manufacturer data on the actual installed product."]
[null,"Equipment Needed"]
[null,"1) Camera"]
[null,"2) Measuring Tape or ruler",null,null,null,null,null,null,null,null,null,"Insulation Type","Typical Thermal Resistance R-value per Inch","Application"]
[null,"3) Relevant Wall Sections and Details",null,null,null,null,null,null,null,null,null,"Extruded polystyrene (XPS)",5,"Walls, Roof, Slab"]
[null,"4) Cellar Plan",null,null,null,null,null,null,null,null,null,"Extruded polystyrene Ultra (XPS Ultra)",5.6,"Walls"]
[null,null,null,null,null,null,null,null,null,null,null,"Mineral Wool Batts",3.4,"Walls, Attic, Floor"]
[null,"Sampling Requirements:",null,null,null,null,null,null,null,null,null,"Fiberglass Batts",3.4,"Walls, Attic, Floor"]
[null,"1) Each unique assembly shall be inspected.  (For example:  If unique sections of the building are constructed differently, all distinct areas must be inspected independently; Also, if insulation specifications are different for living areas vs. common areas or other special use areas, each different specification shall be inspected independently.)",null,null,null,null,null,null,null,null,null,"Low-Density Sprayed Polyurethane Foam; “½ pound foam” (e.g. Icynene)",3.2,"Walls, Attic, Floor"]
[null,"2) Sampling may be used to inspect wall assemblies that are consistent throughout large sections of the building.  Inspections done from the exterior shall sample at least 15% of each wall area.  For inspections done from interior spaces, follow the modified RESNET sampling protocol outlined in the How to Use this Manual section on page 11 of the T&V Protocols, for each unique wall type.  In addition, the sample set must include, at a minimum, all unique assemblies.  If problems are found in the sample set, additional inspections must be conducted to determine the full extent of the problems and to ensure that repairs are completed in all areas of the building where they are needed.",null,null,null,null,null,null,null,null,null,"High-Density Sprayed Polyurethane Foam; “2 pound foam” (e.g. Corbond)","5.0-7.0","Walls, Attic, Floor"]
[null,"3) Documentation of post-repair conditions is required for correction of problems that represent large surface areas (greater than 50 square feet) and/or systemic problems (e.g. all corner units are insulated improperly).  On-site inspection to verify corrections is preferable, but if this is not possible/practical due to construction schedules, photographic documentation of repairs submitted to the responsible party by the GC are an acceptable alternative.",null,null,null,null,null,null,null,null,null,"Cellulose",3.2,"Walls, Attic, Floor"]
[null,"4) *PHOTOS REQUIRED*",null,null,null,null,null,null,null,null,null,"Polyisocyanurate (Polyiso)",6.5,"Walls, Roof "]
[null,"- Photo clearly identifying type of insulation to be installed and thickness using measuring tape or ruler (can do each individual piece of insulation or entire assembly)\n- Photo showing continuous insulation around sample corner and other challenging details\n- Photo of pre-insulation showing application of water/vapor/air barrier\n- Photo of post-installation",null,null,null,null,null,null,null,null,null,"Expanded Polystyrene (EPS)",4,"Walls, Roof"]
[]
[null,"NOTES FOR DRAWINGS AND SPECIFICATIONS",null,null,null,"PLAN REVIEW COMMENTS","LOCATION\n(dwg/spec)","PLAN REVIEW"]
[null,"• Interior and cavity insulation must be protected from air intrusion, moisture intrusion, and free of voids, gaps, and compression.  \n• Cavity insulation must be in contact with the interior wall surface (i.e. drywall) and completely fill the interior wall cavity.\n• Batt insulation must be installed properly using splices to surround wires, electrical outlet/switch/junction boxes, pipes, and other obstructions within the insulated cavity. \n• Insulation that is intended to be continuous (interior or exterior) must be installed without breaks and at full thickness at all locations.\n• Insulation must be installed such that they achieve RESNET-defined Grade I installation or, alternatively, Grade II for walls with continuous insulation.\n• Vapor impermeable air barriers for general coverage should only be specified on the warm side of insulation (i.e. interior side of insulation in predominately heating dominated climates). Vapor permeable air barriers should be specified in other cases.\n• An area weighted average of the U-factors of the wall and floor perimeter assemblies is acceptable in the energy model. When calculating the wall U-factor, the full R-value for any exterior wall insulation can only be used for portions of the assembly where shelf angles or other continuous metal fastened to the wall are not used.  For portions of this assembly where shelf angles or other continuous metal fastened to the wall are used, the exterior insulation cannot contribute to the assembly R-value and an overall U-value shall be calculated based on an area weighted ratio."]
[null,"WALL TYPE:  This section can be duplicated, copy and insert rows",null,null,null,"DESCRIPTION\nInclude:\nStud-framing spacing (ex. 16\" oc)\nStud material (ex. wood or steel) \nStud depth/configuration (ex. 2x4)","LOCATION\ndwg / spec","PLAN REVIEW","INSPECTION","INSPECTION COMMENTS \n(Use this field to note problems, specific inspection details, or changes in As-Built compared to Design, like model numbers. If installed as designed, please state “Same as Design”. If make/model numbers have changed, list them here.)"]
[null,"BG WALL ASSEMBLY 1",null,null,"Layer 1"]
[null,"Name: ",null,null,"Layer 2"]
[null,"Location:  ",null,null,"Layer 3"]
[null,"% of BG wall area: ",null,null,"Layer 4"]
[null,"Appendix A table referenced: ",null,null,"Layer 5"]
[]
[null,"BG ASSEMBLY 1 U-VALUE",null,null,"Overall U-value"]
[]
[null,"BG WALL ASSEMBLY 2",null,null,"Layer 1"]
[null,"Name: ",null,null,"Layer 2"]
[null,"Location:  ",null,null,"Layer 3"]
[null,"% of BG wall area: ",null,null,"Layer 4"]
[null,"Appendix A table referenced: ",null,null,"Layer 5"]
[]
[null,"BG ASSEMBLY 2 U-VALUE",null,null,"Overall U-value"]
[null,"PATH REQUIREMENT",null,"PROPOSED\nERM","ENERGY \nMODEL","Overall Below Grade Wall \nU-Value","LOCATION\ndwg / spec","PLAN REVIEW","INSPECTION"]
[null,{"$f":"IF('Project Info'!$C$4='Project Info'!$P$35,'Prescriptive Path Checklist'!C27,IF('Project Info'!C4='Project Info'!P36,'Prerequisites Checklist'!C27,\"<Select compliance path on the 'Project Info' tab>\"))","v":"<Select compliance path on the 'Project Info' tab>"},null,{"$f":"ERMs!C24","v":0},{"$f":"ERMs!D24","v":0}]
[]
[]
[null,"PROTOCOL",null,"PATH REQUIREMENT",null,"PLAN REVIEW COMMENTS","LOCATION\n(dwg/spec)","PLAN REVIEW","INSPECTION","INSPECTION COMMENTS \n(Use this field to note problems, specific inspection details, or changes in As-Built compared to Design, like model numbers. If installed as designed, please state “Same as Design”. If make/model numbers have changed, list them here.)"]
[null,"Compliance Statement\n• All assemblies are compliant with the proposed design model or requirements of the Prescriptive Path, including framing factor assumptions. The effective R-value of the installed insulation shall be used in the Proposed Design model (from exterior finish to interior finish)."]
[null,"Below Grade Walls - Insulation Installation Requirements\n\nInsulation and Initial Framing Inspection\n• Verify insulation type, thickness, location, coverage, and installation.  Improperly installed insulation must be derated*.\n• Verify location and continuity of air and vapor barriers (if specified).\n• Protection from air and moisture intrusion of interior and cavity insulation will also be verified.",null,{"$f":"IF('Project Info'!C4='Project Info'!P35,'Prescriptive Path Checklist'!C37,IF('Project Info'!C4='Project Info'!P36,'Prerequisites Checklist'!C36,\"<Select compliance path on the 'Project Info' tab>\"))","v":"<Select compliance path on the 'Project Info' tab>"}]
[null,"Wood-Framed Construction (RECOMMENDED, NOT A PREREQUISITE)\n• For wood-framed construction, Version 3.0 of the ENERGY STAR Certified Homes Thermal Enclosure System Rater Checklist Sections 3 and 5 is recommended to be followed in addition to all applicable T&V Protocols."]
[null,"Final Inspection\n• Verify proper enclosure of insulated cavities through visual inspection."]
[null,"*Estimated R-values for insulation that is improperly installed must be derated using the standards and procedures described in the Mortgage Industry’s National Home Energy Rating Systems, Section 303.4.1.4.2 and Appendix A, “On-Site Inspection Procedures for Minimum Rated Features”.\n",null,null,null,null,null,null,null,null,null,null,null,null,null,null,null,"Yes"]
[null,null,null,null,null,null,null,null,null,null,null,null,null,null,null,null,null,"No"]
[null,null,null,null,null,null,null,null,null,null,null,null,null,null,null,null,null,"N/A"]

{"sheet":"3.1 - ENV_ABOVE GRADE WALLS","index":12,"n_rows":74,"n_cols":17,"rows_kept":74,"cut":false,"hidden":false,"merged":[[9,11,10,13],[70,1,70,9],[9,1,9,6],[10,1,10,6],[23,1,23,6],[21,1,21,6],[45,6,50,6],[65,3,66,4],[69,1,69,7],[67,1,67,4],[68,1,68,4],[20,1,20,6],[26,1,26,4],[36,6,43,6],[65,1,65,2],[66,1,66,2],[63,3,63,4],[64,1,64,4],[25,1,25,4],[22,1,22,6],[4,7,4,8],[5,7,5,8],[6,7,6,8],[8,1,8,6],[19,1,19,6],[7,7,7,8]]}
[null,null,"ENERGY STAR"]
[null,null,"MULTIFAMILY HIGH RISE PROGRAM"]
[null,null,"Project Name: ",{"$f":"'Project Info'!C3","v":0}]
[]
[null,"ENVELOPE - ABOVE GRADE WALLS - PROTOCOL 3.1",null,null,null,null,null,"Date:",null,"Field Verified By:"]
[]
[]
[null,"Schedule:"]
[null,"A minimum of three (3) and as many as five (5) separate site visits are required for most multifamily high-rise buildings."]
[null,"1) Inspections of interior and cavity insulation must take place during construction:  at framing pre-insulation, post-insulation and pre-drywall, and post-completion.",null,null,null,null,null,null,null,null,null,"Please find below some typical thermal resistance R-values for most common insulation materials. Note that these numbers are for reference only; and when available thermal perfomance R-value provided in the the manufacturer data on the actual installed product."]
[null,"2) Inspections of exterior insulation, air, vapor, and weather barrier systems must be completed prior to enclosure.\n"]
[null,null,null,null,null,null,null,null,null,null,null,"Insulation Type","Typical Thermal Resistance R-value per Inch","Application"]
[null,"Equipment Needed",null,null,null,null,null,null,null,null,null,"Extruded polystyrene (XPS)",5,"Walls, Roof, Slab"]
[null,"1) Camera",null,null,null,null,null,null,null,null,null,"Extruded polystyrene Ultra (XPS Ultra)",5.6,"Walls"]
[null,"2) Measuring Tape or ruler",null,null,null,null,null,null,null,null,null,"Mineral Wool Batts",3.4,"Walls, Attic, Floor"]
[null,"3) Relevant Wall Sections and Details",null,null,null,null,null,null,null,null,null,"Fiberglass Batts",3.4,"Walls, Attic, Floor"]
[null,"4) Floor Plans",null,null,null,null,null,null,null,null,null,"Low-Density Sprayed Polyurethane Foam; “½ pound foam” (e.g. Icynene)",3.2,"Walls, Attic, Floor"]
[null,null,null,null,null,null,null,null,null,null,null,"High-Density Sprayed Polyurethane Foam; “2 pound foam” (e.g. Corbond)","5.0-7.0","Walls, Attic, Floor"]
[null,"Sampling Requirements:",null,null,null,null,null,null,null,null,null,"Cellulose",3.2,"Walls, Attic, Floor"]
[null,"1) Each unique wall assembly shall be inspected.  (For example:  if the basement walls are constructed differently from the upper floors, both areas must be inspected independently; also, if insulation specifications are different for living areas vs. common areas or other special use areas, each different specification shall be inspected independently.)",null,null,null,null,null,null,null,null,null,"Polyisocyanurate (Polyiso)",6.5,"Walls, Roof "]
[null,"2) Sampling may be used to inspect wall assemblies that are consistent throughout large sections of the building.  Inspections done from the exterior shall sample at least 15% of each wall area.  For inspections done from interior spaces, follow the modified RESNET sampling protocol outlined in the How to Use this Manual section on page 11 of the T&V Protocols, for each unique wall type.  In addition, the sample set must include, at a minimum, all unique assemblies.  If problems are found in the sample set, additional inspections must be conducted to determine the full extent of the problems and to ensure that repairs are completed in all areas of the building where they are needed.",null,null,null,null,null,null,null,null,null,"Expanded Polystyrene (EPS)",4,"Walls, Roof"]
[null,"3) Documentation of post-repair conditions is required for correction of problems that represent large surface areas (greater than 50 square feet) and/or systemic problems (e.g. all corner units are insulated improperly).  On-site inspection to verify corrections is preferable, but if this is not possible/practical due to construction schedules, photographic documentation of repairs submitted to the responsible party by the GC are an acceptable alternative."]
[null,"4) *PHOTOS REQUIRED*"]
[null,"- Photo clearly identifying type of insulation to be installed and thickness using measuring tape or ruler (can do each individual piece of insulation or entire assembly)\n- Photo showing continuous insulation around sample corner and other challenging details\n- Photo of pre-insulation showing application of water/vapor/air barrier\n- Photo of pre-installation to verify framing construction\n- Photo of post insulation indicating proper installation\n- Photo of completion showing proper drywall installation\n- Photo of Plank/Slab Edge and Rim Joist Insulation between ceiling/floor levels before cladding is installed\n"]
[null,"NOTES FOR DRAWINGS AND SPECIFICATIONS",null,null,null,"PLAN REVIEW COMMENTS","LOCATION\n(dwg/spec)","PLAN REVIEW"]
[null,"• Interior and cavity insulation must be protected from air intrusion, moisture intrusion, and free of voids, gaps, and compression.  \n• Cavity insulation must be in contact with the interior wall surface (i.e. drywall) and completely fill the interior wall cavity.\n• Batt insulation must be installed properly using splices to surround wires, electrical outlet/switch/junction boxes, pipes, and other obstructions within the insulated cavity. \n• For steel-framed and metal buildings, continuous exterior insulation is required on above grade walls. For masonry buildings with metal framing, continuous interior or exterior insulation is required on above grade walls. \n• Insulation that is intended to be continuous (interior or exterior) must be installed without breaks and at full thickness at all locations.\n• Air barrier must be continuous around the entire building.  Air barrier must be detailed at all penetrations and transitions including structural components, connections between dissimilar materials, and window rough openings. Flashing materials and sealants must be used at window openings, through-wall duct penetrations, the transition between the wall and roof barrier, and the transition between the wall and foundation barrier.\n• Insulation must be installed such that they achieve RESNET-defined Grade I installation or, alternatively, Grade II for walls with continuous insulation.\n• Vapor impermeable air barriers for general coverage should only be specified on the warm side of insulation (i.e. interior side of insulation in predominately heating dominated climates). Vapor permeable air barriers should be specified in other cases.\n• An area weighted average of the U-factors of the wall and floor perimeter assemblies is acceptable in the energy model. When calculating the wall U-factor, the full R-value for any exterior wall insulation can only be used for portions of the assembly where shelf angles or other continuous metal fastened to the wall are not used.  For portions of this assembly where shelf angles or other continuous metal fastened to the wall are used, the exterior insulation cannot contribute to the assembly R-value and an overall U-value shall be calculated based on an area weighted ratio."]
[null,"WALL TYPE This section can be duplicated, copy and insert rows",null,null,null,"DESCRIPTION \nInclude:\nStud-framing spacing (ex. 16\" or 24\" oc)\nStud material (ex. wood or steel framed) \nStud depth/configuration (ex. 2x4)","LOCATION\n(dwg/spec)","PLAN REVIEW","INSPECTION","INSPECTION COMMENTS \n(Use this field to note problems, specific inspection details, or changes in As-Built compared to Design, like model numbers. If installed as designed, please state “Same as Design”. If make/model numbers have changed, list them here.)"]
[null,"WALL ASSEMBLY  1\n",null,null,"Layer 1"]
[null,"Name: ",null,null,"Layer 2"]
[null,"Location:  ",null,null,"Layer 3"]
[null,"% of total wall area: ",null,null,"Layer 4"]
[null,"Appendix A table referenced: ",null,null,"Layer 5"]
[null,null,null,null,"Layer 6"]
[]
[null,null,null,null,"Overall U-value"]
[]
[null,"WALL ASSEMBLY  2",null,null,"Layer 1"]
[null,"Name: ",null,null,"Layer 2"]
[null,"Location:  ",null,null,"Layer 3"]
[null,"% of total wall area: ",null,null,"Layer 4"]
[null,"Appendix A table referenced: ",null,null,"Layer 5"]
[null,null,null,null,"Layer 6"]
[]
[null,null,null,null,"Overall U-value"]
[]
[null,"FLOOR EDGE ASSEMBLY 1",null,null,"Layer 1"]
[null,"Name: ",null,null,"Layer 2"]
[null,"Location:  ",null,null,"Layer 3"]
[null,"% of total wall area: ",null,null,"Layer 4"]
[null,"Appendix A table referenced: "]
[null,null,null,null,"Overall U-value"]
[]
[null,"FLOOR EDGE ASSEMBLY 2",null,null,"Layer 1"]
[null,"Name: ",null,null,"Layer 2"]
[null,"Location:  ",null,null,"Layer 3"]
[null,"% of total wall area: ",null,null,"Layer 4"]
[null,"Appendix A table referenced: "]
[null,null,null,null,"Overall U-value"]
[]
[null,"FLOOR TO CEILING U-VALUE","PATH REQUIREMENT","PROPOSED\nERM","ENERGY \nMODEL","Floor to Ceiling Wall Assembly  U-Value","LOCATION\ndwg / spec","PLAN REVIEW","INSPECTION"]
[null,"See Notes above for U-value calculation instructions. \n\nNon-vision glazing areas of window wall systems are to be treated as opaque walls per ASHRAE and when determining minimum Prescriptive Path U-values. ",{"$f":"IF('Project Info'!$C$4='Project Info'!$P$35,'Prescriptive Path Checklist'!C27,IF('Project Info'!C4='Project Info'!P36,'Prerequisites Checklist'!C27,\"<Select compliance path on the 'Project Info' tab>\"))","v":"<Select compliance path on the 'Project Info' tab>"},{"$f":"ERMs!C25","v":0},{"$f":"ERMs!D25","v":0}]
[null,"FLOOR EDGE \nU-VALUE","PATH REQUIREMENT","PROPOSED\nERM","ENERGY \nMODEL","Floor Edge Assembly\nU-Value","LOCATION\ndwg / spec","PLAN REVIEW","INSPECTION"]
[null,"See Notes above for U-value calculation instructions. ",{"$f":"IF('Project Info'!$C$4='Project Info'!$P$35,'Prescriptive Path Checklist'!C27,IF('Project Info'!C4='Project Info'!P36,'Prerequisites Checklist'!C27,\"<Select compliance path on the 'Project Info' tab>\"))","v":"<Select compliance path on the 'Project Info' tab>"},{"$f":"ERMs!C26","v":0},{"$f":"ERMs!D26","v":0}]
[null,"PROTOCOL",null,"PATH REQUIREMENT",null,"PLAN REVIEW COMMENTS","LOCATION\n(dwg/spec)","PLAN REVIEW","INSPECTION","INSPECTION COMMENTS \n(Use this field to note problems, specific inspection details, or changes in As-Built compared to Design, like model numbers. If installed as designed, please state “Same as Design”. If make/model numbers have changed, list them here.)"]
[null,"Compliance Statement\n• All assemblies are compliant with the proposed design model or requirements of the Prescriptive Path, including framing factor assumptions. The effective R-value of the installed insulation shall be used in the Proposed Design model (from exterior finish to interior finish)."]
[null,"Above Grade Walls - Insulation Installation Requirements\n\nInsulation and Initial Framing Inspection\n• Verify insulation type, thickness, location, coverage, and installation.  Improperly installed insulation must be derated*.\n• Verify location and continuity of air and vapor barriers (if specified).\n• Protection from air and moisture intrusion of interior and cavity insulation will also be verified.",null,{"$f":"IF('Project Info'!C4='Project Info'!P35,'Prescriptive Path Checklist'!C37,IF('Project Info'!C4='Project Info'!P36,'Prerequisites Checklist'!C36,\"<Select compliance path on the 'Project Info' tab>\"))","v":"<Select compliance path on the 'Project Info' tab>"}]
[null,"Floor Perimeter/Plank Edge -  Insulation Installation Requirements\n\nInsulation and Framing Inspection\n• Verify insulation type, thickness, location, coverage, and installation.  Improperly installed insulation must be derated*.\n• Verify location and continuity of air and vapor barriers (if specified).\n• Protection from air and moisture intrusion of interior and cavity insulation will also be verified."]
[null,"Continuous Insulation Requirements\n• For steel-framed and metal buildings, continuous exterior insulation is required on above grade walls. For masonry buildings with metal framing, continuous interior or exterior insulation is required on above grade walls. Projected balconies are currently exempt, however, EPA recommends that they are thermally broken."]
[null,"Wood-Framed Construction (RECOMMENDED, NOT A PREREQUISITE)\n• For wood-framed construction, Version 3.0 of the ENERGY STAR Certified Homes Thermal Enclosure System Rater Checklist Sections 3 and 5 is recommended to be followed in addition to all applicable T&V Protocols."]
[null,"Final Inspection\n• Verify proper enclosure of insulated cavities through visual inspection."]
[null,"*Estimated R-values for insulation that is improperly installed must be derated using the standards and procedures described in the Mortgage Industry’s National Home Energy Rating Systems, Section 303.4.1.4.2 and Appendix A, “On-Site Inspection Procedures for Minimum Rated Features”.\n"]
[null,null,null,null,null,null,null,null,null,null,null,null,null,null,null,null,"Yes"]
[null,null,null,null,null,null,null,null,null,null,null,null,null,null,null,null,"No"]
[null,null,null,null,null,null,null,null,null,null,null,null,null,null,null,null,"N/A"]

{"sheet":"3.2 - ENV_ROOF","index":13,"n_rows":58,"n_cols":17,"rows_kept":58,"cut":false,"hidden":false,"merged":[[3,11,4,13],[17,1,17,6],[44,1,44,2],[45,1,45,2],[49,1,49,4],[4,7,4,8],[5,7,5,8],[6,7,6,8],[8,1,8,6],[20,1,20,6],[7,7,7,8],[51,1,51,9],[18,1,18,6],[26,1,26,4],[25,1,25,4],[22,1,22,6],[47,1,47,4],[46,3,46,4],[48,3,48,4],[21,1,21,6],[48,1,48,2],[27,6,34,6],[36,6,43,6],[50,1,50,7],[19,1,19,6]]}
[null,null,"ENERGY STAR"]
[null,null,"MULTIFAMILY HIGH RISE PROGRAM"]
[null,null,"Project Name: ",{"$f":"'Project Info'!C3","v":0}]
[null,null,null,null,null,null,null,null,null,null,null,"Please find below some typical thermal resistance R-values for most common insulation materials. Note that these numbers are for reference only; and when available thermal perfomance R-value provided in the the manufacturer data on the actual installed product."]
[null,"ENVELOPE - ROOF - PROTOCOL 3.2",null,null,null,null,null,"Date:",null,"Field Verified By:"]
[null,null,null,null,null,null,null,null,null,null,null,"Insulation Type","Typical Thermal Resistance R-value per Inch","Application"]
[null,null,null,null,null,null,null,null,null,null,null,"Extruded polystyrene (XPS)",5,"Walls, Roof, Slab"]
[null,"Schedule:",null,null,null,null,null,null,null,null,null,"Extruded polystyrene Ultra (XPS Ultra)",5.6,"Walls"]
[null,"1) Inspections must take place during construction:  pre-insulation, post-insulation and pre-drywall or prior to roof finish, and post-completion.",null,null,null,null,null,null,null,null,null,"Mineral Wool Batts",3.4,"Walls, Attic, Floor"]
[null,null,null,null,null,null,null,null,null,null,null,"Fiberglass Batts",3.4,"Walls, Attic, Floor"]
[null,"Equipment Needed",null,null,null,null,null,null,null,null,null,"Low-Density Sprayed Polyurethane Foam; “½ pound foam” (e.g. Icynene)",3.2,"Walls, Attic, Floor"]
[null,"1) Camera",null,null,null,null,null,null,null,null,null,"High-Density Sprayed Polyurethane Foam; “2 pound foam” (e.g. Corbond)","5.0-7.0","Walls, Attic, Floor"]
[null,"2) Measuring Tape or ruler",null,null,null,null,null,null,null,null,null,"Cellulose",3.2,"Walls, Attic, Floor"]
[null,"3) Relevant Wall and Roof Sections and Details",null,null,null,null,null,null,null,null,null,"Polyisocyanurate (Polyiso)",6.5,"Walls, Roof "]
[null,"4) Roof Plan",null,null,null,null,null,null,null,null,null,"Expanded Polystyrene (EPS)",4,"Walls, Roof"]
[]
[null,"Sampling Requirements:"]
[null,"1) Each unique roof assembly shall be inspected.  (For example:  If there are exposed roofs on lower levels, that are constructed differently from the upper floors, both areas must be inspected independently; Also, if insulation specifications are different for living areas vs. common areas or other special use areas, each different specification shall be inspected independently.)"]
[null,"2) Sampling may be used to inspect roof assemblies that are consistent throughout large sections of the building.  Inspections done from the exterior shall sample at least 15% of each roof area.  For inspections done from interior spaces, follow the modified RESNET sampling protocol outlined in the How to Use this Manual section on page 11 of the T&V Protocols, for each unique roof type.  In addition, the sample set must include, at a minimum, all unique assemblies.  If problems are found in the sample set, additional inspections must be conducted to determine the full extent of the problems and to ensure that repairs are completed in all areas of the building where they are needed."]
[null,"3) To verify the predicted overall R-value, 100% of locations where roof insulation achieves the minimum thickness are to be inspected.  Insulation thickness at roof perimeters shall be inspected at one (1) location per 70 feet of roof perimeter. This shall include, at a minimum, two (2) instances where the roof insulation achieves its maximum thickness.  Each location inspected cannot be within 70 feet of each other along the roof perimeter."]
[null,"4) Documentation of post-repair conditions is required for correction of problems that represent large surface areas (greater than 50 square feet) and/or systemic problems (e.g. all corner units are insulated improperly).  On-site inspection to verify corrections is preferable, but if this is not possible/practical due to construction schedules, photographic documentation of repairs submitted to the responsible party by the GC are an acceptable alternative."]
[null,"5) *PHOTOS REQUIRED*"]
[null,"- Photo clearly identifying type of insulation to be installed and thickness using measuring tape or ruler (can do each individual piece of insulation or entire assembly)\n- Photo showing continuous insulation around sample corner and other challenging details\n- Post insulation photo (pre-drywall for cavity insulation, prior to roof finish for exterior rigid insulation) showing complete and even distribution of insulation\n- Photo of proper enclosure of insulated cavities (if applicable)"]
[]
[null,"NOTES FOR DRAWINGS AND SPECIFICATIONS",null,null,null,"PLAN REVIEW COMMENTS","LOCATION\n(dwg/spec)","PLAN REVIEW"]
[null,"• Interior and cavity insulation must be protected from air and moisture intrusion, and free of voids, gaps, and compression.\n• Cavity insulation must be in contact with the interior wall surface (i.e. drywall) and completely fill the interior wall cavity.\n• Batt insulation must be installed properly using splices to surround wires, electrical outlet/switch/junction boxes, pipes, and other obstructions within the insulated cavity. \n• Insulation that is intended to be continuous (interior or exterior) must be installed without breaks and at full thickness at all locations.\n• Insulation must be installed such that they achieve RESNET-defined Grade I installation or, alternatively, Grade II for roofs with continuous insulation.\n• Vapor impermeable air barriers for general coverage should only be specified on the warm side of insulation (i.e. interior side of insulation in predominately heating dominated climates). Vapor permeable air barriers should be specified in other cases.\n• Sprinkler systems to be designed to not interfere with the performance of thermal and air barriers\n• For built-up insulation on flat roofs, minimum and average R-value for roof surfaces must be specified.  Specifications must require contractor to submit roof insulation software calculator results (e.g. ‘Taper Plus” or equivalent) which will be used to verify effective R-value.\n• An area weighted average of the U-factors of the roof assemblies is acceptable in the energy model. "]
[null,"ROOF TYPE:  This section can be duplicated, copy and insert rows\n(assembly name or number)",null,null,null,"DESCRIPTION \nInclude:\nStud-framing spacing (ex. 16\" or 24\" oc)\nStud material (ex. wood or steel framed) \nStud depth/configuration (ex. 2x4)","LOCATION\n(dwg/spec)","PLAN REVIEW","INSPECTION","INSPECTION COMMENTS \n(Use this field to note problems, specific inspection details, or changes in As-Built compared to Design, like model numbers. If installed as designed, please state “Same as Design”. If make/model numbers have changed, list them here.)"]
[null,"ROOF ASSEMBLY 1",null,"PITCH (Pitched Plank, Built Up Roof)"]
[null,"Name: ",null,null,"Layer 1"]
[null,"Location:  ",null,null,"Layer 2"]
[null,"% of roof area: ",null,null,"Layer 3"]
[null,"Appendix A table referenced: ",null,null,"Layer 4"]
[null,null,null,null,"Layer 5"]
[]
[null,"ROOF ASSEMBLY 1 U-VALUE",null,null,"Overall U-value"]
[]
[null,"ROOF ASSEMBLY 2",null,"PITCH (Pitched Plank, Built Up Roof)"]
[null,"Name: ",null,null,"Layer 1"]
[null,"Location:  ",null,null,"Layer 2"]
[null,"% of roof area: ",null,null,"Layer 3"]
[null,"Appendix A table referenced: ",null,null,"Layer 4"]
[null,null,null,null,"Layer 5"]
[]
[null,"ROOF ASSEMBLY 2 U-VALUE",null,null,"Overall U-value"]
[null,"PATH REQUIREMENT",null,"PROPOSED\nERM","ENERGY \nMODEL","Overall Roof U-Value","LOCATION\ndwg / spec","PLAN REVIEW","INSPECTION"]
[null,{"$f":"IF('Project Info'!$C$4='Project Info'!$P$35,'Prescriptive Path Checklist'!C27,IF('Project Info'!C4='Project Info'!P36,'Prerequisites Checklist'!C27,\"<Select compliance path on the 'Project Info' tab>\"))","v":"<Select compliance path on the 'Project Info' tab>"},null,{"$f":"ERMs!C27","v":0},{"$f":"ERMs!D27","v":0}]
[null,"PROTOCOL",null,"PATH REQUIREMENT",null,"PLAN REVIEW COMMENTS","LOCATION\n(dwg/spec)","PLAN REVIEW","INSPECTION","INSPECTION COMMENTS \n(Use this field to note problems, specific inspection details, or changes in As-Built compared to Design, like model numbers. If installed as designed, please state “Same as Design”. If make/model numbers have changed, list them here.)"]
[null,"Compliance Statement\n• All assemblies are compliant with the proposed design model or requirements of the Prescriptive Path, including framing factor assumptions. The effective R-value of the installed insulation shall be used in the Proposed Design model (from exterior finish to interior finish)."]
[null,"Roof -  Insulation Installation Requirements\n\nInsulation and Initial Framing Inspection\n• Verify insulation type, thickness, location, coverage, and installation.  Improperly installed insulation must be derated*.\n• Verify location and continuity of air and vapor barriers (if specified).\n• Protection from air and moisture intrusion of interior and cavity insulation will also be verified.",null,{"$f":"IF('Project Info'!C4='Project Info'!P35,'Prescriptive Path Checklist'!C37,IF('Project Info'!C4='Project Info'!P36,'Prerequisites Checklist'!C36,\"<Select compliance path on the 'Project Info' tab>\"))","v":"<Select compliance path on the 'Project Info' tab>"}]
[null,"Wood-Framed Construction  (RECOMMENDED, NOT A PREREQUISITE)\n• For wood-framed construction, Version 3.0 of the ENERGY STAR Certified Homes Thermal Enclosure System Rater Checklist Sections 3 and 5 is recommended to be followed in addition to all applicable T&V Protocols."]
[null,"Final Inspection\n• Verify proper enclosure of insulated cavities through visual inspection."]
[null,"*Estimated R-values for insulation that is improperly installed must be derated using the standards and procedures described in the Mortgage Industry’s National Home Energy Rating Systems, Section 303.4.1.4.2 and Appendix A, “On-Site Inspection Procedures for Minimum Rated Features”.\n"]
[]
[]
[]
[null,null,null,null,null,null,null,null,null,null,null,null,null,null,null,null,"Yes"]
[null,null,null,null,null,null,null,null,null,null,null,null,null,null,null,null,"No"]
[null,null,null,null,null,null,null,null,null,null,null,null,null,null,null,null,"N/A"]

{"sheet":"3.3 - ENV_FLOORS","index":14,"n_rows":89,"n_cols":17,"rows_kept":89,"cut":false,"hidden":false,"merged":[[8,11,9,13],[20,1,20,6],[21,1,21,6],[18,1,18,6],[45,6,51,6],[4,7,4,8],[9,1,9,6],[17,1,17,6],[5,7,5,8],[6,7,6,8],[6,1,6,6],[7,7,7,8],[8,1,8,6],[73,1,73,9],[72,1,72,7],[19,1,19,6],[24,1,24,4],[41,1,41,3],[51,1,51,3],[71,1,71,4],[62,1,62,2],[25,6,31,6],[25,1,25,3],[32,1,32,2],[33,1,33,2],[68,1,68,2],[23,1,23,4],[52,1,52,2],[53,1,53,2],[69,1,69,2],[66,1,66,4],[55,6,61,6],[61,1,61,3],[31,1,31,3],[35,6,41,6],[42,1,42,2],[43,1,43,2],[67,3,70,4],[65,3,65,4],[67,1,67,2],[70,1,70,2],[63,1,63,2],[65,1,65,2]]}
[null,null,"ENERGY STAR"]
[null,null,"MULTIFAMILY HIGH RISE PROGRAM"]
[null,null,"Project Name: ",{"$f":"'Project Info'!C3","v":0}]
[]
[null,"ENVELOPE - FLOORS ABOVE UNCONDITIONED SPACES - PROTOCOL 3.3",null,null,null,null,null,"Date:",null,"Field Verified By:"]
[]
[]
[null,"Schedule:"]
[null,"1) Inspections must take place during construction:  before pouring slab, before back-filling foundation walls, at framing (pre-insulation), post-insulation and pre-drywall, and post-completion.",null,null,null,null,null,null,null,null,null,"Please find below some typical thermal resistance R-values for most common insulation materials. Note that these numbers are for reference only; and when available thermal perfomance R-value provided in the the manufacturer data on the actual installed product."]
[]
[null,null,null,null,null,null,null,null,null,null,null,"Insulation Type","Typical Thermal Resistance R-value per Inch","Application"]
[null,"Equipment Needed",null,null,null,null,null,null,null,null,null,"Extruded polystyrene (XPS)",5,"Walls, Roof, Slab"]
[null,"1) Camera",null,null,null,null,null,null,null,null,null,"Extruded polystyrene Ultra (XPS Ultra)",5.6,"Walls"]
[null,"2) Measuring Tape or ruler",null,null,null,null,null,null,null,null,null,"Mineral Wool Batts",3.4,"Walls, Attic, Floor"]
[null,"3) Relevant Floor Plan Sections and Details",null,null,null,null,null,null,null,null,null,"Fiberglass Batts",3.4,"Walls, Attic, Floor"]
[null,null,null,null,null,null,null,null,null,null,null,"Low-Density Sprayed Polyurethane Foam; “½ pound foam” (e.g. Icynene)",3.2,"Walls, Attic, Floor"]
[null,"Sampling Requirements:",null,null,null,null,null,null,null,null,null,"High-Density Sprayed Polyurethane Foam; “2 pound foam” (e.g. Corbond)","5.0-7.0","Walls, Attic, Floor"]
[null,"1) Each unique floor assembly shall be inspected.  (For example:  If unique sections of the building are constructed differently, all distinct areas must be inspected independently; Also, if insulation specifications are different for living areas vs. common areas or other special use areas, each different specification shall be inspected independently.)",null,null,null,null,null,null,null,null,null,"Cellulose",3.2,"Walls, Attic, Floor"]
[null,"2) Sampling may be used to inspect floor assemblies that are consistent throughout large sections of the building.  At each stage of the inspection process, a minimum of 15% of total floor area must be inspected for each unique floor type.  If problems are found in the sample set, additional inspections must be conducted to determine the full extent of the problems and to ensure that repairs are completed in all areas of the building where they are needed.",null,null,null,null,null,null,null,null,null,"Polyisocyanurate (Polyiso)",6.5,"Walls, Roof "]
[null,"3) Documentation of post-repair conditions is required for correction of problems that represent large surface areas (greater than 50 square feet) and/or systemic problems (e.g. all corner units are insulated improperly).  On-site inspection to verify corrections is preferable, but if this is not possible/practical due to construction schedules, photographic documentation of repairs submitted to the responsible party by the GC are an acceptable alternative.",null,null,null,null,null,null,null,null,null,"Expanded Polystyrene (EPS)",4,"Walls, Roof"]
[null,"4) *PHOTOS REQUIRED*"]
[null,"- Photo clearly identifying type of insulation installed and thickness using measuring tape or ruler (can do each individual piece of insulation or entire assembly)\n- Photo showing continuous insulation around sample corner and/or trouble area\n- Sub Slab insulation – Photo of insulation before pouring of concrete or backfill of foundation\n- If moisture or insect protection is required, photo of proper installation is required\n- Framed floors – Photo of post-insulation to show proper installation showing no signs of compromised R-Value\n"]
[null,"NOTES FOR DRAWINGS AND SPECIFICATIONS",null,null,null,"PLAN REVIEW COMMENTS","LOCATION\n(dwg/spec)","PLAN REVIEW"]
[null,"• Interior and cavity insulation must be protected from air intrusion and moisture intrusion, and free of voids, gaps, and compression.  \n• Cavity insulation must be in contact with the interior wall surface (i.e. drywall) and completely fill the interior wall cavity.\n• Batt insulation must be installed properly using splices to surround wires, electrical outlet/switch/junction boxes, pipes, and other obstructions within the insulated cavity. \n• Insulation that is intended to be continuous (interior or exterior) must be installed without breaks and at full thickness at all locations.\n• Insulation must be installed such that they achieve RESNET-defined Grade I installation or, alternatively, Grade II for floors with continuous insulation.\n• Vapor impermeable air barriers for general coverage should only be specified on the warm side of insulation (i.e. interior side of insulation in predominately heating dominated climates). Vapor permeable air barriers should be specified in other cases.\n• If specified, rim joists between ceiling/floor levels must be insulated around the entire perimeter, and necessity of shelf angles should be evaluated by structural engineer.\n• An area weighted average of the U-factors of the floor assemblies is acceptable in the energy model. "]
[null,"FLOOR TYPE: This section can be duplicated, copy and insert rows ",null,null,null,"DESCRIPTION\nInclude:\nStud-framing spacing (ex. 16\" or 24\" oc)\nStud material (ex. wood or steel framed) \nStud depth/configuration (ex. 2x4)","LOCATION\n(dwg/spec)","PLAN REVIEW","INSPECTION","INSPECTION COMMENTS \n(Use this field to note problems, specific inspection details, or changes in As-Built compared to Design, like model numbers. If installed as designed, please state “Same as Design”. If make/model numbers have changed, list them here.)"]
[null,"FLOOR OVER UNCONDITIONED SPACE ASSEMBLY 1",null,null,"Layer 1"]
[null,"Name: ",null,null,"Layer 2"]
[null,"Location:  ",null,null,"Layer 3"]
[null,"% of floor area: ",null,null,"Layer 4"]
[null,"Appendix A table referenced: ",null,null,"Layer 5"]
[]
[null,"FLOOR OVER UNCONDITIONED SPACE ASSEMBLY 1 \nU-VALUE",null,null,"Overall U-value"]
[null,"PATH REQUIREMENT",null,"PROPOSED\nERM","ENERGY \nMODEL","Overall Floor Over Unconditioned Space U-Value","LOCATION\ndwg / spec","PLAN REVIEW","INSPECTION"]
[null,{"$f":"IF('Project Info'!C4='Project Info'!P35,'Prescriptive Path Checklist'!C27,IF('Project Info'!C4='Project Info'!P36,'Prerequisites Checklist'!C27,\"<Select compliance path on the 'Project Info' tab>\"))","v":"<Select compliance path on the 'Project Info' tab>"},null,{"$f":"ERMs!C28","v":0},{"$f":"ERMs!D28","v":0}]
[]
[null,"BELOW GRADE SLAB FLOOR ASSEMBLY 1",null,null,"Layer 1"]
[null,"Name: ",null,null,"Layer 2"]
[null,"Location:  ",null,null,"Layer 3"]
[null,"% of BG slab area: ",null,null,"Layer 4"]
[null,"Appendix A table referenced: ",null,null,"Layer 5"]
[]
[null,"BG SLAB FLOOR ASSEMBLY 1 U-VALUE",null,null,"Overall U-value"]
[null,"PATH REQUIREMENT",null,"PROPOSED\nERM","ENERGY \nMODEL","Overall Below Grade Slab Floor  U-Value","LOCATION\ndwg / spec","PLAN REVIEW","INSPECTION"]
[null,{"$f":"IF('Project Info'!C4='Project Info'!P35,'Prescriptive Path Checklist'!C27,IF('Project Info'!C4='Project Info'!P36,'Prerequisites Checklist'!C27,\"<Select compliance path on the 'Project Info' tab>\"))","v":"<Select compliance path on the 'Project Info' tab>"},null,{"$f":"ERMs!C29","v":0},{"$f":"ERMs!D29","v":0}]
[]
[null,"SLAB-ON-GRADE (unheated) ASSEMBLY 1",null,null,"Layer 1"]
[null,"Name: ",null,null,"Layer 2"]
[null,"Location:  ",null,null,"Layer 3"]
[null,"% of slab area: ",null,null,"Layer 4"]
[null,"Appendix A table referenced: ",null,null,"Layer 5"]
[]
[null,"SLAB-ON-GRADE(unheated) ASSEMBLY 1 U-value",null,null,"Overall U-value"]
[null,"PATH REQUIREMENT",null,"PROPOSED\nERM","ENERGY \nMODEL","Overall Slab-On-Grade(unheated) U-Value","LOCATION\ndwg / spec","PLAN REVIEW","INSPECTION"]
[null,{"$f":"IF('Project Info'!C4='Project Info'!P35,'Prescriptive Path Checklist'!C27,IF('Project Info'!C4='Project Info'!P36,'Prerequisites Checklist'!C27,\"<Select compliance path on the 'Project Info' tab>\"))","v":"<Select compliance path on the 'Project Info' tab>"},null,{"$f":"ERMs!C30","v":0},{"$f":"ERMs!D30","v":0}]
[]
[null,"SLAB-ON-GRADE (embedded heat only) ASSEMBLY 1",null,null,"Layer 1"]
[null,"Name: ",null,null,"Layer 2"]
[null,"Location:  ",null,null,"Layer 3"]
[null,"% of slab area: ",null,null,"Layer 4"]
[null,"Appendix A table referenced: ",null,null,"Layer 5"]
[]
[null,"SLAB-ON-GRADE FLOOR (embedded heat only)",null,null,"Overall U-value"]
[null,"PATH REQUIREMENT",null,"PROPOSED\nERM","ENERGY \nMODEL","Overall Slab-On-Grade (embedded heat only) U-Value","LOCATION\ndwg / spec","PLAN REVIEW","INSPECTION"]
[null,{"$f":"IF('Project Info'!C4='Project Info'!P35,'Prescriptive Path Checklist'!C27,IF('Project Info'!C4='Project Info'!P36,'Prerequisites Checklist'!C27,\"<Select compliance path on the 'Project Info' tab>\"))","v":"<Select compliance path on the 'Project Info' tab>"},null,{"$f":"ERMs!C31","v":0},{"$f":"ERMs!D31","v":0}]
[]
[null,"PROTOCOL",null,"PATH REQUIREMENT",null,"PLAN REVIEW \nCOMMENTS","LOCATION\n(dwg/spec)","PLAN REVIEW","INSPECTION","INSPECTION COMMENTS \n(Use this field to note problems, specific inspection details, or changes in As-Built compared to Design, like model numbers. If installed as designed, please state “Same as Design”. If make/model numbers have changed, list them here.)"]
[null,"Compliance Statement\n• All assemblies are compliant with the proposed design model or requirements of the Prescriptive Path, including framing factor assumptions. The effective R-value of the installed insulation shall be used in the Proposed Design model (from exterior finish to interior finish)."]
[null,"Floor Insulation Above Unconditioned Space -  Insulation Installation Requirements\n\nInsulation and Initial Framing Inspection\n• Verify insulation type, thickness, location, coverage, and installation.  Improperly installed insulation must be derated*.\n• Verify location and continuity of air and vapor barriers (if specified).\n• Protection from air and moisture intrusion of interior and cavity insulation will also be verified.",null,{"$f":"IF('Project Info'!C4='Project Info'!P35,'Prescriptive Path Checklist'!C37,IF('Project Info'!C4='Project Info'!P36,'Prerequisites Checklist'!C36,\"<Select compliance path on the 'Project Info' tab>\"))","v":"<Select compliance path on the 'Project Info' tab>"}]
[null,"Below Grade Slab Floor-  Insulation Installation Requirements\n\nInsulation Inspection\n• Verify insulation type, thickness, location, coverage, and installation.  Improperly installed insulation must be derated*.\n• Verify location and continuity of air and vapor barriers (if specified).\n• Protection from air and moisture intrusion of interior and cavity insulation will also be verified."]
[null,"Slab-on-Grade (unheated) -  Insulation Installation Requirements\n\nInsulation Inspection\n• Verify insulation type, thickness, location, coverage, and installation.  Improperly installed insulation must be derated*.\n• If following the Prescriptive Path,Insulation shall be placed on the outside of the foundation or on the inside of a foundation wall. The insulation shall extend downward from the top of the slab for a minimum distance as shown in Prescriptive Path Table 3 or to the top of the footing, whichever is less, or downward to at least the bottom of the slab and then horizontally to the interior or exterior for the total distance shown in the table.\n• Verify location and continuity of air and vapor barriers (if specified).\n• Protection from air and moisture intrusion of interior and cavity insulation will also be verified."]
[null,"Slab-on-Grade (embedded heated only) -  Insulation Installation Requirements\n\nInsulation Inspection\n• Verify insulation type, thickness, location, coverage, and installation.  Improperly installed insulation must be derated*.\n• If following the Prescriptive Path, insulation shall be placed on the outside of the foundation or on the inside of a foundation wall. The insulation shall extend downward from the top of the slab for a minimum distance as shown in Prescriptive Path Table 3 or to the top of the footing, whichever is less, or downward to at least the bottom of the slab and then horizontally to the interior or exterior for the total distance shown in the table.\n• Verify location and continuity of air and vapor barriers (if specified).\n• Protection from air and moisture intrusion of interior and cavity insulation will also be verified."]
[null,"Wood-Framed Construction  (RECOMMENDED, NOT A PREREQUISITE)\n• For wood-framed construction, Version 3.0 of the ENERGY STAR Certified Homes Thermal Enclosure System Rater Checklist Sections 3 and 5 is recommended to be followed in addition to all applicable T&V Protocols."]
[null,"Final Inspection\n• Verify proper enclosure of insulated cavities through visual inspection."]
[null,"*Estimated R-values for insulation that is improperly installed must be derated using the standards and procedures described in the Mortgage Industry’s National Home Energy Rating Systems, Section 303.4.1.4.2 and Appendix A, “On-Site Inspection Procedures for Minimum Rated Features”.\n"]
[]
[]
[]
[]
[]
[]
[]
[]
[]
[]
[]
[]
[null,null,null,null,null,null,null,null,null,null,null,null,null,null,null,null,"Yes"]
[null,null,null,null,null,null,null,null,null,null,null,null,null,null,null,null,"No"]
[null,null,null,null,null,null,null,null,null,null,null,null,null,null,null,null,"N/A"]

{"sheet":"3.4 - ENV_WINDOWS","index":15,"n_rows":53,"n_cols":20,"rows_kept":53,"cut":false,"hidden":false,"merged":[[45,1,45,13],[40,1,40,13],[41,1,41,13],[42,1,42,13],[43,1,43,13],[44,1,44,13],[12,13,12,14],[39,1,39,5],[39,6,39,11],[38,6,38,11],[8,1,8,9],[26,6,26,11],[8,10,8,11],[37,6,37,11],[38,1,38,2],[26,1,26,5],[16,1,16,9],[10,10,10,11],[25,6,25,11],[17,1,17,9],[18,1,18,9],[9,13,9,14],[4,13,4,14],[20,1,20,9],[4,5,4,12],[5,13,5,14],[6,13,6,14],[5,1,5,4],[5,10,5,11],[8,13,8,14],[6,1,6,4],[7,13,7,14],[7,10,7,11],[6,10,6,11],[7,1,7,9],[10,13,10,14],[11,13,11,14],[13,13,13,14],[14,13,14,14],[15,13,15,14],[16,13,16,14],[17,13,17,14],[23,13,23,14],[24,13,24,14],[18,13,18,14],[19,13,19,14],[20,13,20,14],[21,13,21,14],[22,13,22,14]]}
[null,null,"ENERGY STAR"]
[null,null,"MULTIFAMILY HIGH RISE PROGRAM"]
[null,null,"Project Name: ",{"$f":"'Project Info'!C3","v":0}]
[]
[null,"ENVELOPE - WINDOWS - PROTOCOL 3.4",null,null,null,null,null,null,null,null,null,null,null,"Date:",null,"Field Verified By:"]
[]
[null,"Schedule:"]
[null,"1) If the developer has elected, the initial sample installation shall be inspected upon completion.  If problems are identified with the sample installation, a return site visit may be necessary to verify that the problems were properly addressed and corrected before proceeding with the installation of windows building-wide."]
[null,"2) All other window inspections will take place on an ongoing basis during construction at the same time that other building envelope components are inspected to ensure specifications are being met throughout the construction process."]
[]
[null,"Equipment Needed"]
[null,"1) Camera"]
[null,"2) Measuring Tape or ruler"]
[null,"3) Window Schedule and Relevant Details"]
[]
[null,"Sampling Requirements:"]
[null,"1)  For spaces containing windows, follow the modified RESNET sampling protocol outlined in the How to Use this Manual section on page 11 of the T&V Protocols, which shall include, at a minimum, one of each different type of window installation based on different window types (fixed, double hung, etc.) and different energy performance specifications (e.g. if low e glass is specified on part of the building but not all of it)."]
[null,"2)  In addition, the sample set shall include, at a minimum, the inspection of all windows in a representative apartment from each apartment style/type. "]
[null,"3)  If problems are identified, additional windows must be inspected to determine if problems are systemic.  Problems found will be reported to the GC for correction and re-inspection on an ongoing basis throughout construction."]
[null,"4) *PHOTOS REQUIRED*"]
[null,"- Photo of each unique window type with third party verification (NFRC label if applicable) of U-Value, SHGC, and ENERGY STAR certification (if applicable)\n- Photo of installed window that verifies proper fit and effective connections to envelope’s weather and air barriers\n- Photo with low-e sensor device verifying low-e"]
[]
[]
[]
[]
[null,"NOTES FOR DRAWINGS AND SPECIFICATIONS",null,null,null,null,"PLAN REVIEW COMMENTS",null,null,null,null,null,"LOCATION\n(dwg/spec)","PLAN REVIEW"]
[null,"• Include selection of window type (by operation, e.g. double-hung, single-hung, casement, fixed, etc.), dimensions, frame, U-value, low-emissivity, gas fill, SHGC, visual transmittance, and labeling by an independent third party (e.g. NFRC). If an NFRC label is not available, manufacturer must provide assembly U-values, not center-of-glass. Alternatively, LBNL’s WINDOW 6.3 software or NFRC’s CMAST may be used.\n• The specified windows shall be double or triple-pane, with low-emissivity glass or coatings.\n• Windows shall be installed properly to ensure weather tightness and air tightness performance within manufacturer’s specifications in addition to proper operation.\n• All joints between window frame and rough opening should be sealed with minimum 20-year sealant compatible with all surfaces.\n• Specifications could include, at the discretion of the developer, the inspection of a sample mock-up installation by the responsible party prior to installation of windows building-wide."]
[null,"ID","WINDOW TYPE\n(Double hung, awning, casement, fixed)","QUANTITY","MFR/MODEL","WINDOW FRAME \n(Alum, Fiberglass)","GAS FILL\n(Air / Argon)","CENTER OF GLASS \nU-VALUE ","ASSEMBLY U-VALUE","SHGC ","LOW-E\n(Yes/No)","ENERGY STAR\n(Yes/No)","LOCATION\n(dwg/spec)","PLAN REVIEW","INSPECTION","INSPECTION COMMENTS \n(Use this field to note problems, specific inspection details, or changes in As-Built compared to Design, like model numbers. If installed as designed, please state “Same as Design”. If make/model numbers have changed, list them here.)"]
[]
[]
[]
[]
[]
[]
[]
[]
[]
[null,null,null,"PATH REQUIREMENT","PROPOSED \nERM","ENERGY \nMODEL","PLAN REVIEW COMMENTS",null,null,null,null,null,"LOCATION\n(dwg/spec)","PLAN REVIEW","INSPECTION","INSPECTION COMMENTS \n(Use this field to note problems, specific inspection details, or changes in As-Built compared to Design, like model numbers. If installed as designed, please state “Same as Design”. If make/model numbers have changed, list them here.)"]
[null,"Compliance Statement\n• Assembly is consistent with the project specifications and Proposed Design model\n• If following the Prescriptive Path confirm assembly U-values and SHGC for the climate zone are met.",null,{"$f":"IF('Project Info'!C4='Project Info'!P35,'Prescriptive Path Checklist'!C48,IF('Project Info'!C4='Project Info'!P36,'Prerequisites Checklist'!C47,\"<Select compliance path on the 'Project Info' tab>\"))","v":"<Select compliance path on the 'Project Info' tab>"},{"$f":"ERMs!C32","v":0},{"$f":"ERMs!D32","v":0}]
[null,"Window-to-Wall Ratio\n• Window-to-Wall ratio is taken as the sum of all window area divided by the total exterior above-grade wall area. All decorative glass and skylight window area contribute to the total window area to above-grade wall ratio (WWR). In addition, non-vision glazing areas must be treated as opaque walls (not fenestration) when calculating window-to-wall ratios. Maximum allowable glazing area for Prescriptive Path: 30% WWR\n\n"]
[null,"Rough Openings\n• The installation subcontractor is responsible for verifying that rough openings are properly constructed including: structural soundness of sill, header, and jambs; opening shall be square, level, and plumb; and building materials should be protected from moisture damage prior to window installation.  Construction deficiencies should be reported to the developer or GC and corrected prior to installation of windows."]
[null,"Window/Wall Mock Up\n• If approved by the developer, the responsible party shall inspect a sample installation of the window prior to the installation of windows building-wide.  The manufacturer’s data shall be inspected to verify energy performance specifications (window type, frame, U-value factor, gas fill, SHGC).  In addition, the installed window must be inspected for proper fit and operation and effective connections to the building envelope weather barrier and air barrier.  Low-e glass must be verified using a low-e meter."]
[null,"On-Going Site Inspections\n• On inspection site visits, the responsible party shall check newly installed windows for compliance with the installation specifications and confirm the assumptions in the Proposed Design model. As an alternative to the modeling approach, verify all window requirements listed in the Prescriptive Path have been met or exceeded."]
[null,"Air Tightness\n• Visually confirm all joints between window frame and rough opening have been sealed.  Optional: To verify air tightness of the weather stripping and window installation, use a smoke pencil around the window, casing, and frame."]
[null,"Windows - Manufacturer's Product Data\n• Review manufacturer’s cut sheet or invoice detailing window construction, U-Value, SHGC, low–e, and ENERGY STAR qualification (if applicable). Alternatively, LBNL’s WINDOW 6.3 software or NFRC’s CMAST may be used."]
[null,"Statement of Substantial Completion\n• A Statement of Substantial Completion or approved proxy may be used to establish completion of the work associated with this protocol. A Statement of Substantial Completion is to be completed by the installation contractor or other qualified representative on company letterhead, complete with all information, photographs, cut sheets, etc., required in this protocol and in the corresponding T&V Worksheet."]
[]
[]
[]
[]
[null,null,null,null,null,null,null,null,null,null,null,null,null,null,null,null,null,null,null,"Yes"]
[null,null,null,null,null,null,null,null,null,null,null,null,null,null,null,null,null,null,null,"No"]
[null,null,null,null,null,null,null,null,null,null,null,null,null,null,null,null,null,null,null,"N/A"]

{"sheet":"3.5 - ENV_EXTERIOR DOORS","index":16,"n_rows":49,"n_cols":17,"rows_kept":49,"cut":false,"hidden":false,"merged":[[38,1,38,10],[40,12,40,13],[41,12,41,13],[39,1,39,10],[40,1,40,10],[41,1,41,10],[39,12,39,13],[38,12,38,13],[37,12,37,13],[22,1,22,9],[31,12,31,13],[30,12,30,13],[37,6,37,8],[37,1,37,2],[37,3,37,5],[35,1,35,2],[29,12,29,13],[28,12,28,13],[26,12,26,13],[35,12,35,13],[35,6,35,8],[36,12,36,13],[36,6,36,8],[8,1,8,4],[27,12,27,13],[24,6,24,8],[36,1,36,2],[25,1,25,5],[25,6,25,8],[20,1,20,9]]}
[null,null,"ENERGY STAR"]
[null,null,"MULTIFAMILY HIGH RISE PROGRAM"]
[null,null,"Project Name: ",{"$f":"'Project Info'!C3","v":0}]
[]
[null,"ENVELOPE - EXTERIOR DOORS - PROTOCOL 3.5",null,null,null,null,null,null,null,null,null,null,"Date:","Field Verified By:"]
[]
[null,"Schedule:"]
[null,"1)  Final inspection may occur anytime following completion of installations ."]
[]
[]
[null,"Equipment Needed"]
[null,"1) Camera"]
[null,"2) Measuring Tape or ruler"]
[null,"3) Floor Plans"]
[null,"4) Door Manufacturer's Specifications"]
[null,"5) As-built Door Schedule provided by the developer"]
[null,"6) Smoke Pencil (Optional)"]
[]
[null,"Sampling Requirements:"]
[null,"1)  100% of entryways and designed vestibule areas shall be inspected."]
[null,"2)  Visually verify proper installation of at least 50% of all common area exterior doors and check the manufacturer and model of all doors using the As-Built building door schedule provided by the developer.  For garden-style apartments with doors to the exterior, follow the modified RESNET sampling protocol outlined in the How to Use this Manual section on page 11 of the MFHR Testing and Verification Protocol."]
[null,"3) *PHOTOS REQUIRED*"]
[null,"- Photo of installed door that verifies proper fit and effective connections to envelope’s weather and air barriers.\n- Photo of each unique door type with third party verification, NFRC and/or ENERGY STAR certification (if applicable)."]
[]
[null,"NOTES FOR DRAWINGS AND SPECIFICATIONS",null,null,null,null,"PLAN REVIEW COMMENTS",null,null,"LOCATION\ndwg / spec","PLAN REVIEW"]
[null,"• Design and specifications for exterior doors shall match assumptions made in the Proposed Design model or meets or exceeds the requirements listed in the Prescriptive Path.  \n• Weather-stripping is mandatory at doors between conditioned spaces and the exterior; unconditioned spaces; and spaces vented to the outside.\n• Weather-stripping is recommended, but not required, at doors between corridors and stairwells; between apartments and corridors; and doors leading to mechanical rooms. \n• Weather-stripping at mandatory locations shall be installed with a rigid fastener and replaceable foam gasket specified for durability and less maintenance.\n• Weather stripping shall be installed to not interfere with door closing properly."]
[null,"ID","FLOOR / LOCATION","MFR/MODEL","ENERGY STAR (Yes/No)","U-VALUE","WEATHER-STRIPPING\n(Yes/No)","SELF CLOSING DEVICE\n(Yes/No)","VESTIBULE\n(Yes/No)","LOCATION\ndwg / spec","PLAN REVIEW","INSPECTION","INSPECTION COMMENTS \n(Use this field to note problems, specific inspection details, or changes in As-Built compared to Design, like model numbers. If installed as designed, please state “Same as Design”. If make/model numbers have changed, list them here.)"]
[]
[]
[]
[]
[]
[]
[]
[]
[null,"PROTOCOL",null,"PATH REQUIREMENT","ERM ","ENERGY \nMODEL","PLAN REVIEW COMMENTS",null,null,"LOCATION\ndwg / spec","PLAN REVIEW","INSPECTION","INSPECTION COMMENTS \n(Use this field to note problems, specific inspection details, or changes in As-Built compared to Design, like model numbers. If installed as designed, please state “Same as Design”. If make/model numbers have changed, list them here.)"]
[null,"Compliance Statement\n• Assembly is consistent with the project specifications and Proposed Design model or meets or exceeds the requirements listed in the Prescriptive Path.",null,{"$f":"IF('Project Info'!$C$4='Project Info'!$P$35,\"The envelope components must comply with ASHRAE Standard 90.1-2007 Section 5.4. \"&'Prescriptive Path Checklist'!C27,IF('Project Info'!C4='Project Info'!P36,\"The envelope components must comply with ASHRAE Standard 90.1-2007 Section 5.4. \"&'Prerequisites Checklist'!C27,\"<Select compliance path on the 'Project Info' tab>\"))","v":"<Select compliance path on the 'Project Info' tab>"},{"$f":"ERMs!C33","v":0},{"$f":"ERMs!D33","v":0}]
[null,"Vestibules and Entryways\n• Inspect vestibule and entryway areas to verify construction is consistent with design specifications. ",null,{"$f":"IF('Project Info'!C4='Project Info'!P35,'Prescriptive Path Checklist'!C50,IF('Project Info'!C4='Project Info'!P36,'Prerequisites Checklist'!C48,\"<Select compliance path on the 'Project Info' tab>\"))","v":"<Select compliance path on the 'Project Info' tab>"}]
[null,"Operation and Fit\n• Inspect exterior doors for proper operation, fit, and weather stripping."]
[null,"Weather Stripping\n• When required by local building code, verify entranceways contain vestibules with weather-stripping hard-fastened to the door or frame.\n• Weather-stripping is mandatory at doors between conditioned spaces and the exterior; unconditioned spaces; and spaces vented to the outside.\n• Weather-stripping is recommended, but not required, at doors between corridors and stairwells; between apartments and corridors; and doors leading to mechanical rooms. \n• Weather-stripping at mandatory locations shall be installed with a rigid fastener and replaceable foam gasket specified for durability and less maintenance."]
[null,"Smoke Testing\n• Option:  Use a smoke pencil with the building under pressurization (or depressurization) from the ventilation system to verify air tightness of components."]
[null,"Statement of Substantial Completion\n• A Statement of Substantial Completion or approved proxy may be used to establish completion of the work associated with this protocol. A Statement of Substantial Completion is to be completed by the installation contractor or other qualified representative on company letterhead, complete with all information, photographs, cut sheets, etc., required in this protocol and in the corresponding T&V Worksheet."]
[]
[]
[]
[]
[null,null,null,null,null,null,null,null,null,null,null,null,null,null,null,null,"Yes"]
[null,null,null,null,null,null,null,null,null,null,null,null,null,null,null,null,"No"]
[null,null,null,null,null,null,null,null,null,null,null,null,null,null,null,null,"N/A"]

{"sheet":"4.1 - GARAGES_CMPTZ & HEATING ","index":17,"n_rows":32,"n_cols":14,"rows_kept":32,"cut":false,"hidden":false,"merged":[[4,7,4,8],[5,7,5,8],[6,7,6,8],[9,7,9,8],[8,7,8,8],[7,7,7,8],[26,1,26,7],[7,1,7,5],[8,1,8,5],[9,1,9,5],[20,1,20,4],[25,1,25,7],[24,1,24,4],[22,1,22,2],[22,3,22,4],[23,1,23,2],[23,3,23,4]]}
[null,null,"ENERGY STAR"]
[null,null,"MULTIFAMILY HIGH RISE PROGRAM"]
[null,null,"Project Name: ",{"$f":"'Project Info'!C3","v":0}]
[]
[null,"GARAGES - HEATING & COMPARTMENTALIZATION - PROTOCOL 4.1",null,null,null,null,null,"Date:",null,"Field Verified By:"]
[]
[null,"Schedule:"]
[null,"1) Inspect air sealing details at framing before insulation is installed.\n"]
[null,"2) Inspect insulation after installation and prior to enclosure with finish materials."]
[null,"3) Final inspection may occur anytime following completion of installations.\n"]
[]
[null,"Equipment Needed"]
[null,"1) Relevant floor plans and wall sections"]
[null,"2) Camera"]
[]
[null,"Sampling Requirements:"]
[null,"1) Inspect 100% of the connections between the garage and the conditioned space of the building for air sealing."]
[null,"2) Inspect 100% of heating elements and controls."]
[]
[null,"NOTES FOR DRAWINGS AND SPECIFICATIONS",null,null,null,"PLAN REVIEW COMMENTS","LOCATION\ndwg / spec","PLAN REVIEW"]
[null,"• Provide piping layout or insulation details that demonstrate that the garage space is not heated. Radiant heating, either wall or ceiling-mounted or within the garage floor (or sidewalks), may be used to prevent ice formation on the ground as a safety feature only. \n• Include a list of elements to be sealed in the garage that would minimize air flow between the garage and the rest of the building, including entrance door(s) leading into building from garage."]
[null,"PROTOCOL",null,null,null,"PLAN REVIEW COMMENTS","LOCATION\ndwg / spec","PLAN REVIEW","INSPECTION","INSPECTION COMMENTS \n(Use this field to note problems, specific inspection details, or changes in As-Built compared to Design, like model numbers. If installed as designed, please state “Same as Design”. If make/model numbers have changed, list them here.)"]
[null,"Garage Pipe Freeze Protection\n• If pipes are located in garages or unconditioned spaces, heat tape is permitted, but only in the Performance Path, where the energy penalty associated with the electricity consumption can be modeled.  If selecting this alternative, heat tape that is activated based on pipe wall temperature rather than air temperature is required and must comply with ASHRAE 90.1-2007 Section 6.4.3.8.  Verify heat tape thermostat set point is no higher than 40°F.",null,{"$f":"IF('Project Info'!C4='Project Info'!P35,'Prescriptive Path Checklist'!C54,IF('Project Info'!C4='Project Info'!P36,'Prerequisites Checklist'!C52,\"<Select compliance path on the 'Project Info' tab>\"))","v":"<Select compliance path on the 'Project Info' tab>"}]
[null,"Garage Snow or Ice-melt Systems\n• Verify snow or ice melt systems in the garage, either wall or ceiling-mounted, are radiant (ie. \"infrared\") OR located within the garage floor/sidewalks. \n• Confirm that they are used to prevent ice formation on the ground as a safety feature ONLY (and not for comfort or pipe freeze protection) and include controls capable of shutting off the systems. \n• Snow- and ice-melting systems shall include automatic controls capable of shutting off the systems when the pavement temperature is above 50°F and an automatic or manual control that will allow shutoff when the outdoor temperature is above 40°F so that the potential for snow or ice accumulation is negligible.",null,{"$f":"IF('Project Info'!C4='Project Info'!P35,'Prescriptive Path Checklist'!C55,IF('Project Info'!C4='Project Info'!P36,'Prerequisites Checklist'!C53,\"<Select compliance path on the 'Project Info' tab>\"))","v":"<Select compliance path on the 'Project Info' tab>"}]
[null,"Compartmentalization\n• Attached garages shall be fully compartmentalized from the rest of the building through air sealing.  All pipe and conduit penetrations shall be sealed with material compatible with the surface and resilient to temperature fluctuations."]
[null,"Wood-Framed Construction  (RECOMMENDED, NOT A PREREQUISITE)\n• For wood-framed construction, Version 3.0 of the ENERGY STAR Qualified Homes Thermal Enclosure System Rater Checklist Sections 3 and 5 is recommended in addition to all applicable T&V Protocols."]
[null,"Doors Between Garage and Building\n• Inspect the door(s) leading into the building from the garage for proper operation, fit, and weather stripping.  Optional: Use a smoke pencil around the door, casing, and frame with the garage ventilation system running."]
[]
[]
[null,null,null,null,null,null,null,null,null,null,null,null,null,"Yes"]
[null,null,null,null,null,null,null,null,null,null,null,null,null,"No"]
[null,null,null,null,null,null,null,null,null,null,null,null,null,"N/A"]

{"sheet":"5.1, 5.3 - HEATING","index":18,"n_rows":92,"n_cols":22,"rows_kept":92,"cut":false,"hidden":false,"merged":[[80,11,80,12],[69,7,69,11],[68,1,68,6],[71,1,71,6],[70,1,70,15],[69,1,69,6],[66,7,66,11],[66,1,66,6],[58,1,58,15],[59,7,59,11],[65,1,65,15],[61,7,61,11],[62,7,62,11],[56,1,56,6],[59,1,59,6],[67,1,67,6],[56,7,56,11],[47,1,47,4],[48,1,48,4],[49,1,49,4],[50,1,50,4],[61,1,61,2],[61,3,61,6],[53,3,53,6],[55,7,55,11],[53,7,53,11],[51,1,51,15],[49,7,49,11],[52,7,52,11],[55,1,55,6],[57,1,57,6],[47,7,47,11],[85,6,85,7],[78,13,78,14],[83,11,83,12],[77,11,77,12],[77,13,77,14],[81,11,81,12],[54,7,54,11],[68,7,68,11],[82,11,82,12],[84,11,84,12],[57,7,57,11],[73,1,73,13],[64,1,64,13],[71,7,71,11],[82,13,82,14],[83,13,83,14],[84,13,84,14],[78,11,78,12],[60,7,60,11],[63,1,63,13],[62,1,62,6],[60,1,60,6],[67,7,67,11],[54,1,54,6],[45,1,45,2],[45,7,45,11],[48,7,48,11],[46,7,46,11],[46,3,46,4],[50,7,50,11],[86,13,86,14],[79,13,79,14],[80,13,80,14],[81,13,81,14],[85,11,85,12],[85,13,85,14],[86,11,86,12],[79,11,79,12],[72,1,72,13],[86,6,86,7],[82,6,82,7],[81,6,81,7],[77,6,77,7],[80,6,80,7],[78,6,78,7],[79,6,79,7],[83,6,83,7],[84,6,84,7],[12,14,12,15],[13,8,13,9],[43,7,43,11],[20,1,20,9],[12,10,12,11],[11,10,11,11],[12,1,12,4],[12,8,12,9],[11,1,11,9],[42,7,42,11],[13,10,13,11],[43,1,43,2],[43,3,43,4],[19,1,19,9],[22,1,22,10],[44,1,44,15],[11,12,11,13],[11,14,11,15],[52,1,52,6],[46,1,46,2],[45,3,45,4],[4,14,4,15],[5,10,5,11],[6,14,6,15],[10,10,10,11],[4,12,4,13],[5,12,5,13],[5,14,5,15],[8,12,8,13],[9,12,9,13],[7,14,7,15],[8,14,8,15],[9,14,9,15],[10,14,10,15],[6,8,6,9],[5,8,5,9],[6,12,6,13],[7,12,7,13],[12,12,12,13],[8,1,8,9],[9,1,9,9],[7,1,7,9],[10,1,10,9],[8,10,8,11],[10,12,10,13],[9,10,9,11],[7,10,7,11],[5,1,5,4],[6,1,6,4],[6,10,6,11]]}
[null,null,"ENERGY STAR"]
[null,null,"MULTIFAMILY HIGH RISE PROGRAM"]
[null,null,"Project Name: ",{"$f":"'Project Info'!C3","v":0}]
[]
[null,"HVAC - HEATING SYSTEMS - PROTOCOL 5.1, 5.3",null,null,null,null,null,null,null,null,null,null,"Date:",null,"Field Verified By:"]
[]
[null,"Schedule:"]
[null,"1) The quality assurance and verification procedures occur during the pre-construction, construction, and post-construction phases of system installation.  Refer to the appropriate standards (eg. NFPA) to determine exact timing of inspections."]
[null,"2) Commissioning of the system occurs during pre-construction and construction phases of installation. Inspection, testing, and final commissioning are conducted during the turn over/accpetance phase of the installation of the system."]
[null,"3) Training shall occur following installation of the system and completion of all quality assurance and verification procedures.  \n"]
[null,"4) The developer or GC shall ensure that deliveries are inspected prior to accepting them to verify that product substitutions by the distributor or manufacturer have not resulted in plumbing fixtures with higher flow rates than those in the Proposed Design or required by the Prescriptive Path."]
[null,"5) Minimum of one (1) on-site inspection required, preferably immediately after installation so that corrective action can be taken if necessary.  Delivery tickets may be used to verify complete shipments but on-site inspections of a sample of installed plumbing fixtures is required.\n"]
[]
[null,"Equipment Needed"]
[null,"1) Mechanical Schedule and Floor Plans"]
[null,"2) Camera"]
[]
[null,"Sampling Requirements:"]
[null,"1)  100% of centralized primary equipment (i.e. heating plants) shall be inspected in the quality assurance and verification process.  "]
[null,"2)  Individual spaces or apartments containing electric or fossil-fuel heating systems shall be inspected and tested following the modified RESNET sampling protocol outlined in the How to Use this Manual section on page 11 of the T&V Protocols, including at least one of each unique type. "]
[null,"3)  Spaces containing terminal devices (fan coils, PTHPS, unit heaters, VAV boxes) must be inspected following the modified RESNET sampling protocol outlined in the How to Use this Manual section on page 11 of the T&V Protocols, including at least one of each unique type. "]
[null,"4) *PHOTOS REQUIRED* "]
[null,"-Provide photos of the space heating systems and faceplates to verify proper installation and compliance with proposed design.\n"]
[null,"ID","DESCRIPTION","LOCATION/SERVES","QUANTITY","MFR","MODEL #","CAPACITY (BTU/H, kW) ","AHRI CERT #","EFFICIENCY\n(% Et, AFUE, COP)","FAN MOTOR \nPOWER (HP, kW/CFM)","ENERGY STAR","Outdoor Air Supply (% or CFM)","PLAN REVIEW","INSPECTION","INSPECTION COMMENTS \n(Use this field to note problems, specific inspection details, or changes in As-Built compared to Design, like model numbers. If installed as designed, please state “Same as Design”. If make/model numbers have changed, list them here.)"]
[]
[]
[]
[]
[]
[]
[]
[]
[]
[]
[]
[]
[]
[]
[]
[]
[]
[]
[null,"PROTOCOL",null,"PATH REQUIREMENT",null,"PROPOSED \nERM","ENERGY \nMODEL","PLAN REVIEW COMMENTS",null,null,null,null,"LOCATION\n(dwg/spec)","PLAN REVIEW","INSPECTION","INSPECTION COMMENTS \n(Use this field to note problems, specific inspection details, or changes in As-Built compared to Design, like model numbers. If installed as designed, please state “Same as Design”. If make/model numbers have changed, list them here.)"]
[null,"Compliance Statement\n• All heating systems are consistent with the project specifications and Proposed Design model or meets or exceeds the requirements listed in the Prescriptive Path.",null,{"$f":"IF('Project Info'!C4='Project Info'!P35,'Prescriptive Path Checklist'!C57,IF('Project Info'!C4='Project Info'!P36,'Prerequisites Checklist'!C55,\"<Select compliance path on the 'Project Info' tab>\"))","v":"<Select compliance path on the 'Project Info' tab>"},null,"See below","See below"]
[null,"MODELING INPUTS"]
[null,"Space Heating - Type & Efficiency\n• Provide Proposed space heating system type, efficiency, capacity, fuel; include number, efficiency and HP of pumps, and whether VFD is specified in the MOTOR section.\n• Heating equipment efficiency must be verified through AHRI ratings. If not available, OEM-provided performance data must be used, in compliance with ASHRAE 90.1-2007, Section 6.4.1.4.\n• If following the Prescriptive Path, based on the climate zone, the specified heating equipment must meet the Prescriptive requirements for efficiency in Table 1, a list of equipment and minimum efficiencies per ASHRAE 90.1 – 2007 Climate Zones. Part load minimum efficiencies listed are only applicable to equipment with capacity modulation. See ASHRAE 189.1-2009, Appendix C, for equipment not listed in Table 1.\n• The appropriate climate zone for each building site shall be determined by ASHRAE 90.1–2007, Table B-1. Exception: The appropriate climate zone for each building site in California will be determined by Title 24.",null,{"$f":"IF('Project Info'!C4='Project Info'!P35,'Prescriptive Path Checklist'!C60&\"\n\n\"&'Prescriptive Path Checklist'!C63,IF('Project Info'!C4='Project Info'!P36,'Prerequisites Checklist'!C58,\"<Select compliance path on the 'Project Info' tab>\"))","v":"<Select compliance path on the 'Project Info' tab>"},null,{"$f":"ERMs!C35","v":0},{"$f":"ERMs!D35","v":0}]
[null,"Heating Terminal Units - Electric Resistance or Freeze Protection\n• If following the Prescriptive Path:\nElectric resistance space heating is not permitted in any space.\n\nIf following the Performance Path:\n• Avoidable electric resistance heating should not be specified in apartments or common areas (top of stairwells, vestibules and other common areas).\n• EPA recommends that supplemental heating systems are not specified for pipe freeze protection in unconditioned spaces. If specified, their energy consumption must be modeled.",null,{"$f":"IF('Project Info'!C4='Project Info'!P35,'Prescriptive Path Checklist'!C61,IF('Project Info'!C4='Project Info'!P36,\"N/A\",\"<Select compliance path on the 'Project Info' tab>\"))","v":"<Select compliance path on the 'Project Info' tab>"},null,{"$f":"ERMs!C36","v":0},{"$f":"ERMs!D36","v":0}]
[null,"Space Heating - Sizing\n• Heating loads shall be calculated, equipment capacity shall be selected, and duct systems shall be sized according to the latest editions of Air-Conditioning Contractors Association (ACCA) Manual J, S, & D respectively, ASHRAE 2009 Handbook of Fundamentals, or a substantively equivalent procedure, and provided by the design engineer to the responsible party. Indoor temperatures shall be 70°F for heating, outdoor temperatures shall be the 99.0% design temperatures as published by the ASHRAE Handbook of Fundamentals. Installed capacity cannot exceed design by more than 20%, except when smaller sizes are not available.  For condensing boilers, plans must specify return water temperature at design conditions.",null,null,null,{"$f":"ERMs!C38","v":0},{"$f":"ERMs!D38","v":0}]
[null,"Space Heating Distribution - Supply Fan Power\n• Supply fan power shall be consistent with the project specifications and Proposed Design model.",null,null,null,{"$f":"ERMs!C37","v":0},{"$f":"ERMs!D37","v":0}]
[null,"Space Heating - Design Temperatures\n• Plans must specify supply and return water temperature at design conditions.  \n• Verify installation of temperature gauges and temperature readings during inspection.\n• Verify return water temperature meets design for condensing boiler systems.",null,null,null,{"$f":"ERMs!C39","v":0},{"$f":"ERMs!D39","v":0}]
[null,"Space Heating - Controls\n• System controls and settings shall match operating assumptions made in the Proposed Design model or meets or exceeds the requirements listed in the Prescriptive Path. At a minimum, controls should have the capability for outdoor reset of supply water temperature, warm weather shut down and night setback.\n• Verify outdoor temperature sensor is functioning properly.\n• Verify supply temperature is set correctly and sensor is functioning properly.",null,null,null,{"$f":"ERMs!C40","v":0},{"$f":"ERMs!D40","v":0}]
[null,"BOILER CONFIGURATION AND HYDRONIC DISTRIBUTION"]
[null,"Space Heating Central Plant - Boiler room location and venting\n• Verify location of heating system (e.g., cellar or roof), combustion air venting configuration (e.g., combustion air piped to boilers, boiler room air used for combustion), and venting configuration (e.g., inducer fan specified and sequence of operation verified, if required)."]
[null,"Space Heating - Insulation for Piping\n\n\n",null,{"$f":"IF('Project Info'!C4='Project Info'!P35,'Prescriptive Path Checklist'!C82,IF('Project Info'!C4='Project Info'!P36,'Prerequisites Checklist'!C78,\"<Select compliance path on the 'Project Info' tab>\"))","v":"<Select compliance path on the 'Project Info' tab>"}]
[null,"Heating Distribution - Piping Configuration\n• Specifications for distribution system (supply and return) piping configuration, mixing valves, and zoning shall match assumptions made in Proposed Design model or meets or exceeds the requirements listed in the Prescriptive Path have been met or exceeded. \n• For systems without automatic balancing valves, all supply/return headers must be designed in a “reverse return” configuration (i.e. first riser supplied is the last returned, etc.) and/or sized based on a water velocity of less than 4 ft/s.  Total pressure drop of terminal unit branch piping and fittings between a supply and return riser must be significantly greater than the total pressure drop from the top to the bottom of these risers."]
[null,"Heating Distribution - Pump Sizing\n• Calculations and assumptions for sizing circulating pumps must meet Chapter 43 of the ASHRAE Handbook, HVAC Systems and Equipment or equivalent industry accepted standard and keep with the building file."]
[null,"Heating Distribution - Pressure Control Set-points\n• Although not required, EPA recommends adding a Note requiring heating circulator pressure controls to be adjusted to ensure that: (1) at terminal units furthest from the pump, sufficient GPM is achieved and (2) at terminal units closest to the pump, differential pressure across terminal unit zone valves when closed does not exceed valve manufacturer guidelines."]
[null,"Heating Terminal Units - Thermostatic Controls\n• All terminal heating distribution equipment must be separated from the riser or distribution loop by a control valve or terminal distribution pump, so that heated fluid is not delivered to the apartment distribution equipment when there is no call for heat from the apartment thermostats."]
[null,"ALL FORCED AIR HEATING SYSTEMS (Including Heat Pumps)"]
[null,"Heating Distribution - Outdoor Air Damper\n• For systems designed with outdoor-air supplied to the heating distribution system, provide motorized dampers that will automatically shut when systems or spaces are not in use. Continuously running ventilation would not be subject to either damper, as they are always in use."]
[null,"Heating Distribution - Flex Duct Installation\n• Verify that all heating ductwork that has been specified as flex duct meets the Sheet Metal Air Conditioning Contractors National Association (SMACNA) installation standards  (see Appendix A of the Prescriptive Path or the Performance Path)."]
[null,"Heating Distribution - Duct Insulation",null,{"$f":"IF('Project Info'!C4='Project Info'!P35,'Prescriptive Path Checklist'!C78,IF('Project Info'!C4='Project Info'!P36,'Prerequisites Checklist'!C74,\"<Select compliance path on the 'Project Info' tab>\"))","v":"<Select compliance path on the 'Project Info' tab>"}]
[null,"Heating Distribution - Duct Sealing Details\n• Call out a preliminary list of duct sealing details to be integrated into the construction documents and inspected must include the following at a minimum.  This criteria also applies to heat pump units:\na  Roof curb penetration has been sealed  \nb. Mastic or other UL-181 compliant material has been applied within temperature range and according to all other manufacturer's requirements at ALL transverse joints and take offs.\nc. All duct transitional junctions have been sealed with mastic or other UL-181 compliant material.\nd. Gap between take off duct and gypsum board has been effectively sealed.\n"]
[null,"Heating System - Combustion Venting\n• Visual inspection of combustion venting system to verify conformance with Proposed Design model, the requirements listed in the Prescriptive Path, and appropriate National Fire Protection Association (NFPA)  standards.  This criteria also applies to heat pump units.\n• For gas systems reference NFPA 54 (National Fuel Gas Code).  For oil systems reference NFPA 31."]
[null,"Heating System - Refrigerant Charge, Airflow and Nameplate Data\n• Obtain and keep documentation on file showing correct field measured refrigerant charge, field measured airflow over condenser coil, field measured airflow over heat exchanger, nameplate efficiency, and nameplate heat exchange capacity consistent with manufacturer’s specifications."]
[null,"IN-UNIT FORCED AIR HEATING SYSTEMS"]
[null,"Heating Distribution - In-Unit Duct Sizing\n• In-unit duct systems shall be designed and installed to effectively meet the heating loads for the spaces served using the Air Conditioning Contractors Association (ACCA) Manuals J, and D ASHRAE 2009 Handbook of Fundamentals, or a substantively equivalent procedure, and provided by the design engineer to the responsible party."]
[null,"Heating Distribution - In-Unit Pressure Balancing\n• Verify that bedrooms have been provided with any combination of transfer grills, jump ducts, dedicated return ducts, and/or undercut doors to provide pressure-balancing."]
[null,"Heating Distribution - In-Unit Duct Leakage Testing\n• Following the procedures outlined in your duct leakage tester operation manual, a one-point test for total duct leakage in the main duct shaft using a calibrated fan measured under depressurization or pressurization is acceptable for this measurement.  Per the Prerequisites Checklist the total duct leakage for in-unit systems shall be ≤8 CFM25 per 100 ft^2 conditioned floor area. Final testing occurs after the building is completed: air handlers, ductwork, supply.return registers installed and sealed, and interior drywall finished. Note that non-ducted returns must include the return air pathway in the pressurized testing of the distribution system.\n• When conducting a duct leakage depressurization test, the flow conditioner and one of the flow rings must always be installed.\n• Provide a summary of results of any duct leakage testing; a sample table is provided below. As an alternative to testing at building completion, total duct leakage measured at rough-in, shall be ≤4 CFM25 per 100 ft2, with air handler and all ductwork installed.\n• Ensure duct systems can be physically sealed and pressurized for duct leakage testing. For ventilation systems that utilize an intake duct to the return side of the HVAC system without motorized dampers, GC must provide interior or exterior access to the intake duct so that it can be sealed during testing."]
[null,"Heating Distribution - HVAC Contractor Checklist\n• For improved performance, EPA recommends, but does not require compliance with all items of Version 3.0 of the ENERGY STAR Certified Homes HVAC System Quality Installation Rater and Contractor Checklists, where applicable to forced air heating systems.This criteria also applies to heat pump units."]
[null,"HEATING SYSTEMS MISC"]
[null,"Heating Distribution - Thermostat\n• Verify all terminal heating distribution equipment serving an apartment shall be controlled by a thermostat(s) within the same apartment."]
[null,"Space Heating - Training and Manuals\n• EPA recommends confirming that all applicable operating and specification manuals are delivered to the building staff. EPA also recommends verifying that staff members have been trained and are aware of their responsibilities to maintain and operate the systems properly. Summarize any training performed and personnel involved."]
[null,"Space Heating - Manufacturer's Product Data\n• Review manufacturer’s cut sheets or invoice detailing system manufacturer, model, size, and location,  (including all space heating systems, e.g. vestibule) and keep with the building file. All heating equipment efficiency must be verified through AHRI ratings. If not available, OEM-provided performance data must be used, in compliance with ASHRAE 90.1-2007, Section 6.4.1.4. If following the Prescriptive Path and ENERGY STAR certification is required, it must be verified through the ENERGY STAR website."]
[]
[null,"Duct Leakage Summary: This section can be duplicated, copy and insert rows. If the same system provides cooling, data need only be entered in one worksheet."]
[]
[null,"Apartment #","Floor #","Unit Type \n(e.g. A, B, C)","# of Bedrooms","Floor Area","Design Supply CFM",null,"Rough-in Maximum Leakage \nCFM25 ","Rough-in Tested Total Leakage CFM25 ","Final Maximum Leakage \nCFM25 ","Final \nTested Total \nLeakage CFM25",null,"% Leakage of Design CFM",null,"Comments"]
[null,null,null,null,null,null,null,null,{"$f":"4*F79/100","v":0},null,{"$f":"8*F79/100","v":0},null,null,{"$f":"L79/(F79)","v":{"$error":"#DIV/0!"}}]
[null,null,null,null,null,null,null,null,0,null,{"$f":"8*F80/100","v":0},null,null,{"$error":"#DIV/0!"}]
[null,null,null,null,null,null,null,null,0,null,0,null,null,{"$error":"#DIV/0!"}]
[null,null,null,null,null,null,null,null,0,null,0,null,null,{"$error":"#DIV/0!"}]
[null,null,null,null,null,null,null,null,0,null,0,null,null,{"$error":"#DIV/0!"}]
[null,null,null,null,null,null,null,null,0,null,0,null,null,{"$error":"#DIV/0!"}]
[null,null,null,null,null,null,null,null,0,null,0,null,null,{"$error":"#DIV/0!"}]
[null,null,null,null,null,null,null,null,0,null,0,null,null,{"$error":"#DIV/0!"}]
[null,null,null,null,null,null,null,null,0,null,0,null,null,{"$error":"#DIV/0!"}]
[]
[]
[null,null,null,null,null,null,null,null,null,null,null,null,null,null,null,null,null,null,null,null,null,"Yes"]
[null,null,null,null,null,null,null,null,null,null,null,null,null,null,null,null,null,null,null,null,null,"No"]
[null,null,null,null,null,null,null,null,null,null,null,null,null,null,null,null,null,null,null,null,null,"N/A"]

{"sheet":"5.2, 5.4 - COOLING","index":19,"n_rows":80,"n_cols":21,"rows_kept":80,"cut":false,"hidden":false,"merged":[[72,11,72,12],[69,13,69,14],[70,13,70,14],[71,13,71,14],[72,13,72,14],[63,11,63,12],[64,11,64,12],[65,11,65,12],[66,11,66,12],[67,11,67,12],[68,11,68,12],[63,13,63,14],[64,13,64,14],[65,13,65,14],[66,13,66,14],[67,13,67,14],[68,13,68,14],[69,11,69,12],[70,11,70,12],[71,11,71,12],[75,6,75,7],[75,9,75,10],[75,11,75,12],[75,13,75,14],[63,15,63,16],[64,15,64,16],[65,15,65,16],[66,15,66,16],[67,15,67,16],[68,15,68,16],[63,5,63,6],[64,5,64,6],[65,5,65,6],[66,5,66,6],[71,5,71,6],[72,5,72,6],[67,5,67,6],[68,5,68,6],[69,5,69,6],[70,5,70,6],[69,15,69,16],[70,15,70,16],[71,15,71,16],[72,15,72,16],[4,15,4,16],[6,15,6,16],[10,15,10,16],[31,6,31,12],[7,15,7,16],[9,1,9,10],[7,1,7,10],[10,9,10,10],[8,13,8,14],[9,15,9,16],[5,15,5,16],[10,11,10,12],[6,11,6,12],[6,9,6,10],[11,11,11,12],[5,13,5,14],[32,6,32,12],[9,13,9,14],[5,9,5,10],[7,13,7,14],[11,9,11,10],[6,13,6,14],[7,11,7,12],[8,15,8,16],[9,11,9,12],[5,11,5,12],[8,1,8,10],[6,1,6,4],[17,1,17,10],[8,11,8,12],[32,1,32,2],[33,1,33,16],[37,6,37,12],[41,1,41,5],[41,6,41,12],[39,1,39,5],[39,6,39,12],[34,1,34,2],[37,1,37,3],[40,6,40,12],[36,1,36,3],[36,6,36,12],[40,1,40,5],[35,6,35,12],[35,1,35,3],[50,6,50,12],[49,6,49,12],[54,1,54,14],[46,1,46,5],[50,1,50,5],[48,6,48,12],[34,6,34,12],[38,1,38,16],[47,6,47,12],[47,1,47,5],[45,1,45,16],[43,6,43,12],[49,1,49,5],[46,6,46,12],[43,1,43,5],[42,6,42,12],[44,1,44,14],[48,3,48,5],[48,1,48,2],[42,1,42,2],[42,3,42,5],[53,6,53,12],[51,6,51,12],[56,6,56,12],[58,1,58,14],[55,1,55,16],[57,1,57,5],[56,1,56,5],[59,1,59,14],[51,1,51,5],[52,1,52,5],[52,6,52,12],[57,6,57,12],[53,1,53,2],[53,3,53,5]]}
[null,null,"ENERGY STAR"]
[null,null,"MULTIFAMILY HIGH RISE PROGRAM"]
[null,null,"Project Name: ",{"$f":"'Project Info'!C3","v":0}]
[]
[null,"HVAC - COOLING - PROTOCOL 5.2, 5.4",null,null,null,null,null,null,null,null,null,null,null,"Date:",null,"Field Verified By:"]
[]
[null,"Schedule:"]
[null,"1) The quality assurance and verification procedures occur during the pre-construction, construction, and post-construction phases of system installation.  Refer to the appropriate standards (eg. NFPA) to determine exact timing of inspections."]
[null,"2) Commissioning of the system occurs during pre-construction and construction phases of installation. Inspection, testing, and commissioning are conducted during the turn of over/acceptance phase of the installation system. "]
[null,"3) Training shall occur following installation of the system and completion of all quality assurance and verification procedures.  \n"]
[]
[null,"Equipment Needed"]
[null,"1) Mechanical Schedule, relevant floor plans and details"]
[null,"2) Camera"]
[]
[null,"Sampling Requirements:"]
[null,"1)  100% of centralized primary equipment (i.e. cooling plants) shall be inspected in the quality assurance and verification process.  "]
[null,"2)  Spaces containing terminal devices (fan coils, PTHPS, VAV boxes) must be inspected following the modified RESNET sampling protocol outlined in the How to Use this Manual section on page 11 of the T&V Protocols, including at least one of each unique type. "]
[null,"3) *PHOTOS REQUIRED*"]
[null,"-Photos of cooling system equipment and faceplates to verify proper installation and compliance with Proposed Design."]
[null,"ID","DESCRIPTION","LOCATION/\nSERVES","QUANTITY","MFR","Outdoor Unit Model    #","Indoor Coil Model #","AHRI CERT#","CAPACITY (BTU/H)","EFFICIENCY\n(SEER, EER)","FAN MOTOR \nPOWER (HP, kW/CFM)","ENERGY STAR","Outdoor Air Supply (% or CFM)","PLAN REVIEW","INSPECTION","INSPECTION COMMENTS \n(Use this field to note problems, specific inspection details, or changes in As-Built compared to Design, like model numbers. If installed as designed, please state “Same as Design”. If make/model numbers have changed, list them here.)"]
[]
[]
[]
[]
[]
[]
[]
[]
[]
[]
[null,"PROTOCOL",null,"PATH REQUIREMENT","PROPOSED \nERM","ENERGY \nMODEL","PLAN REVIEW COMMENTS",null,null,null,null,null,null,"LOCATION\n(dwg/spec)","PLAN REVIEW","INSPECTION","INSPECTION COMMENTS \n(Use this field to note problems, specific inspection details, or changes in As-Built compared to Design, like model numbers. If installed as designed, please state “Same as Design”. If make/model numbers have changed, list them here.)\n"]
[null,"Compliance Statement\n• All cooling systems are consistent with the project specifications and Proposed Design model or meets or exceeds the requirements listed in the Prescriptive Path.\n",null,{"$f":"IF('Project Info'!C4='Project Info'!P35,'Prescriptive Path Checklist'!C57,IF('Project Info'!C4='Project Info'!P36,'Prerequisites Checklist'!C55,\"<Select compliance path on the 'Project Info' tab>\"))","v":"<Select compliance path on the 'Project Info' tab>"},"see below","see below"]
[null,"MODELING INPUTS"]
[null,"Space Cooling - Type and Efficiency\n• Specifications for the cooling system type, location and efficiency shall match the assumptions made in the Proposed Design model or meets or exceeds the requirements listed in the Prescriptive Path.\n• Cooling equipment efficiency must be verified through AHRI ratings. If not available, OEM-provided performance data must be used, in compliance with ASHRAE 90.1-2007, Section 6.4.1.4. If following the Prescriptive Path and ENERGY STAR certification is required, it must be verified through the ENERGY STAR website.\n• The appropriate climate zone for each building site shall be determined by ASHRAE 90.1–2007, Table B-1. Exception: The appropriate climate zone for each building site in California will be determined by Title 24.\n• See Table 1 for list of equipment and minimum efficiencies per ASHRAE 90.1 – 2007 Climate Zones. Part load minimum efficiencies listed are only applicable to equipment with capacity modulation. See ASHRAE 189.1-2009, Appendix C, for equipment not listed in Table 1.",null,{"$f":"IF('Project Info'!C4='Project Info'!P35,'Prescriptive Path Checklist'!C65,IF('Project Info'!C4='Project Info'!P36,IF('Project Info'!C12=\"Yes\",'Prerequisites Checklist'!R60,'Prerequisites Checklist'!Q60),\"<Select compliance path on the 'Project Info' tab>\"))","v":"<Select compliance path on the 'Project Info' tab>"},{"$f":"ERMs!C42","v":0},{"$f":"ERMs!D42","v":0}]
[null,"Space Cooling - Sizing\n• Cooling loads shall be calculated, equipment capacity shall be selected, and duct systems shall be sized according to the latest editions of Air-Conditioning Contractors Association (ACCA) Manual J, S, & D respectively, ASHRAE 2009 Handbook of Fundamentals, or a substantively equivalent procedure, and provided by the design engineer to the responsible party. Indoor temperatures shall be 75°F for cooling, outdoor temperatures shall be the 1.0% design temperatures as published by the ASHRAE Handbook of Fundamentals. Installed capacity cannot exceed design by more than 20%, except when smaller sizes are not available.  ",null,null,{"$f":"ERMs!C44","v":0},{"$f":"ERMs!D44","v":0}]
[null,"Space Cooling Distribution - Supply Fan Power\n• Supply fan power shall be consistent with the project specifications and Proposed Design model.",null,null,{"$f":"ERMs!C43","v":0},{"$f":"ERMs!D43","v":0}]
[null,"Space Cooling  - Controls\n• System controls and settings shall match operating assumptions made in the Proposed Design model or meets or exceeds the requirements listed in the Prescriptive Path.",null,null,{"$f":"ERMs!C45","v":0},{"$f":"ERMs!D45","v":0}]
[null,"CHILLED WATER AND CONDENSER WATER SYSTEMS"]
[null,"Cooling Distribution - Piping Configuration\n• Verification procedures must confirm that the system meets the specifications and performs according to the assumptions in the Proposed Design model of the project or meets or exceeds the requirements listed in the Prescriptive Path.  A commissioning agent can be hired to complete this inspection and verification or the Partner may be able to perform them.  \n• For systems without automatic balancing valves, all supply/return headers must be designed in a “reverse return” configuration (i.e. first riser supplied is the last returned, etc.) and/or sized based on a water velocity of less than 4 ft/s.  Total pressure drop of terminal unit branch piping and fittings between a supply and return riser must be significantly greater than the total pressure drop from the top to the bottom of these risers."]
[null,"Cooling Distribution - Pump Sizing\n• Calculations and assumptions for sizing circulating pumps must meet Chapter 43 of the ASHRAE Handbook, HVAC Systems and Equipment or equivalent industry accepted standard and keep with the building file."]
[null,"Cooling Distribution - Pressure Control Set-points\n• Although not required, EPA recommends adding a Note requiring cooling circulator pressure controls to be adjusted to ensure that: (1) at terminal units furthest from the pump, sufficient GPM is achieved and (2) at terminal units closest to the pump, differential pressure across terminal unit zone valves when closed does not exceed valve manufacturer guidelines."]
[null,"Cooling Distribution - Pipe Insulation",null,{"$f":"IF('Project Info'!C4='Project Info'!P35,'Prescriptive Path Checklist'!C81,IF('Project Info'!C4='Project Info'!P36,'Prerequisites Checklist'!C77,\"<Select compliance path on the 'Project Info' tab>\"))","v":"<Select compliance path on the 'Project Info' tab>"}]
[null,"Cooling Terminal Units - Thermostatic Controls\n• Verify all terminal cooling distribution equipment must be separated from the riser or distribution loop by a control valve or terminal distribution pump, so that cooled fluid is not delivered to the apartment distribution equipment when there is no call for cooling from the apartment thermostats."]
[null,"Cooling Distribution - Airflow and Nameplate Data\n• Obtain and keep documentation on file showing correct field measured airflow over evaporator coil, nameplate efficiency, and nameplate heat exchange capacity consistent with manufacturer’s specifications."]
[null,"ALL FORCED AIR COOLING SYSTEMS (Including heat pumps, split system ACs, PTACs and room ACs)"]
[null,"Cooling Distribution System - In-Unit Duct Sizing\n• In-unit duct systems shall be designed and installed to effectively meet the cooling loads for the spaces served using the Air Conditioning Contractors Association (ACCA) Manuals J and D ASHRAE 2009 Handbook of Fundamentals, or a substantively equivalent procedure, and provided by the design engineer to the responsible party."]
[null,"Cooling Distribution System - In-Unit Pressure Balancing\n• Verify that bedrooms have been provided with any combination of transfer grills, jump ducts, dedicated return ducts, and/or undercut doors to provide pressure-balancing."]
[null,"Cooling Distribution - Duct Insulation",null,{"$f":"IF('Project Info'!C4='Project Info'!P35,'Prescriptive Path Checklist'!C78,IF('Project Info'!C4='Project Info'!P36,'Prerequisites Checklist'!C74,\"<Select compliance path on the 'Project Info' tab>\"))","v":"<Select compliance path on the 'Project Info' tab>"}]
[null,"Cooling System - Outdoor Air Damper\n• For systems designed with outdoor-air supplied to the cooling distribution system, provide motorized dampers that will automatically shut when systems or spaces are not in use.  Continuously running ventilation would not be subject to either damper, as they are always in use."]
[null,"Cooling Distribution - Duct Sealing Details\n• Call out a preliminary list of duct sealing details to be integrated into the construction documents and inspected must include the following at a minimum:\na  Roof curb and or wall penetrations has been sealed  \nb. Mastic or other UL-181 compliant material has been applied within temperature range and according to all other manufacturer's requirements at ALL transverse joints and take offs.\nc. All duct transitional junctions have been sealed with mastic or other UL-181 compliant material.\nd. Gap between take off duct and gypsum board has been effectively sealed.\n"]
[null,"Cooling Distribution - Flex Duct Installation\n• Verify that all cooling ductwork that has been specified as flex duct meets the Sheet Metal Air Conditioning Contractors National Association (SMACNA) installation standards (see Appendix A of the Prescriptive Path or the Performance Path)."]
[null,"Cooling Distribution - In-Unit Duct Leakage Testing\n• Following the procedures outlined in your duct leakage tester operation manual, a one-point test for total duct leakage in the main duct shaft using a calibrated fan measured under depressurization or pressurization is acceptable for this measurement.  Per the Prerequisites Checklist, the total duct leakage for in-unit systems shall be ≤8 CFM25 per 100 ft2 of conditioned floor area. Final testing occurs after the building is completed: air handlers, ductwork, supply.return registers installed and sealed, and interior drywall finished. Note that non-ducted returns must include the return air pathway in the pressurized testing of the distribution system.\n• When conducting a duct leakage depressurization test, the flow conditioner and one of the flow rings must always be installed.\n• Provide a summary of results of any duct leakage testing; a sample table is provided below. As an alternative to testing at building completion, total duct leakage measured at rough-in, shall be ≤4 CFM25 per 100 ft2, with air handler and all ductwork installed.\n• Ensure duct systems can be physically sealed and pressurized for duct leakage testing. For ventilation systems that utilize an intake duct to the return side of the HVAC system without motorized dampers, GC must provide interior or exterior access to the intake duct so that it can be sealed during testing."]
[null,"Cooling Distribution - Refrigerant Pipe Insulation",null,{"$f":"D43","v":"<Select compliance path on the 'Project Info' tab>"}]
["  ","Cooling System - Refrigerant Charge, Airflow and Nameplate Data\n• Obtain and keep documentation on file showing correct field measured refrigerant charge, field measured airflow over evaporator coil, nameplate efficiency, and nameplate heat exchange capacity consistent with manufacturer’s specifications."]
[null,"COOLING SYSTEMS MISC"]
[null,"Cooling - A/C Sleeves\n• If installing sleeves for through-wall AC units, insulated covers must be provided by the building for use during heating season and when AC units are not installed."]
[null,"Cooling Distribution - Thermostat\n• Verify all terminal cooling distribution equipment serving an apartment shall be controlled by a thermostat(s) within the same apartment."]
[null,"Cooling - Training and Manuals\n• EPA recommends confirming that all applicable operating and specification manuals are delivered to the building staff. EPA also recommends verifying that staff members have been trained and are aware of their responsibilities to maintain and operate the systems properly. Summarize any training performed and personnel involved."]
[null,"Cooling - Manufacturer's Product Data\n• Review manufacturer’s cut sheets or invoice detailing system manufacturer model, size, and location (including all space cooling systems, e.g. lobby). Cooling equipment efficiency must be verified through AHRI ratings. If not available, OEM-provided performance data must be used, in compliance with ASHRAE 90.1-2007, Section 6.4.1.4. If following the Prescriptive Path and ENERGY STAR certification is required, it must be verified through the ENERGY STAR website."]
[]
[null,"Duct Leakage Summary: This section can be duplicated, copy and insert rows.If the same system provides heating, data need only be entered in one worksheet. "]
[]
[null,"Apartment #","Floor #","Unit Type \n(e.g. A, B, C)","# of Bedrooms","Floor Area",null,"Design CFM","Rough-in Maximum Leakage \nCFM25","Rough-in Tested Total Leakage CFM25 ","Final \nMaximum Leakage \nCFM25","Final \nTested \nTotal Leakage CFM25",null,"% Leakage of Design CFM",null,"Comments"]
[null,null,null,null,null,null,null,null,{"$f":"4*(F65/100)","v":0},null,{"$f":"8*(F65/100)","v":0},null,null,{"$f":"L65/F65","v":{"$error":"#DIV/0!"}}]
[null,null,null,null,null,null,null,null,0,null,{"$f":"8*(F66/100)","v":0},null,null,{"$f":"L66/F66","v":{"$error":"#DIV/0!"}}]
[null,null,null,null,null,null,null,null,0,null,0,null,null,{"$error":"#DIV/0!"}]
[null,null,null,null,null,null,null,null,0,null,0,null,null,{"$error":"#DIV/0!"}]
[null,null,null,null,null,null,null,null,0,null,0,null,null,{"$error":"#DIV/0!"}]
[null,null,null,null,null,null,null,null,0,null,0,null,null,{"$error":"#DIV/0!"}]
[null,null,null,null,null,null,null,null,0,null,0,null,null,{"$error":"#DIV/0!"}]
[null,null,null,null,null,null,null,null,0,null,0,null,null,{"$error":"#DIV/0!"}]
[null,null,null,null,null,null,null,null,0,null,0,null,{"$f":"L73/(F73/100)","v":{"$error":"#DIV/0!"}},{"$error":"#DIV/0!"}]
[]
[]
[]
[]
[null,null,null,null,null,null,null,null,null,null,null,null,null,null,null,null,null,null,null,null,"Yes"]
[null,null,null,null,null,null,null,null,null,null,null,null,null,null,null,null,null,null,null,null,"No"]
[null,null,null,null,null,null,null,null,null,null,null,null,null,null,null,null,null,null,null,null,"N/A"]

{"sheet":"6.1, 6.2, 6.3 - LIGHTING","index":20,"n_rows":114,"n_cols":21,"rows_kept":114,"cut":false,"hidden":false,"merged":[[67,10,67,11],[68,10,68,11],[74,15,74,16],[31,15,31,16],[44,1,44,16],[46,15,46,16],[47,15,47,16],[48,15,48,16],[65,10,65,11],[96,13,96,16],[33,5,33,6],[92,2,92,3],[36,5,36,6],[36,7,36,8],[37,5,37,6],[37,7,37,8],[40,7,40,8],[39,5,39,6],[63,7,63,8],[66,1,66,3],[67,1,67,3],[94,3,94,4],[94,5,94,6],[95,13,95,16],[68,1,68,3],[64,7,64,8],[45,15,45,16],[34,5,34,6],[34,7,34,8],[41,5,41,6],[41,7,41,8],[89,13,89,16],[87,15,87,16],[103,1,103,2],[103,3,103,4],[103,5,103,6],[103,7,103,8],[101,1,101,2],[37,15,37,16],[36,15,36,16],[61,13,61,16],[62,1,62,16],[63,15,63,16],[69,1,69,3],[68,7,68,8],[76,15,76,16],[86,15,86,16],[78,15,78,16],[73,15,73,16],[69,10,69,11],[64,1,64,3],[65,1,65,3],[99,7,99,8],[99,5,99,6],[102,1,102,2],[102,3,102,4],[96,3,96,4],[106,13,106,16],[104,13,104,16],[105,13,105,16],[99,13,99,16],[101,13,101,16],[38,5,38,6],[53,15,53,16],[54,15,54,16],[57,15,57,16],[58,15,58,16],[106,1,106,11],[104,1,104,11],[63,1,63,2],[79,15,79,16],[80,15,80,16],[83,15,83,16],[84,15,84,16],[85,15,85,16],[52,15,52,16],[38,15,38,16],[41,15,41,16],[91,2,91,3],[55,15,55,16],[56,15,56,16],[105,1,105,11],[32,5,32,6],[33,7,33,8],[32,7,32,8],[38,7,38,8],[35,5,35,6],[35,7,35,8],[13,13,13,14],[13,15,13,16],[27,13,27,16],[26,13,26,16],[32,15,32,16],[33,15,33,16],[34,15,34,16],[98,1,98,2],[49,15,49,16],[50,15,50,16],[51,15,51,16],[75,15,75,16],[65,15,65,16],[66,15,66,16],[35,15,35,16],[103,13,103,16],[90,2,90,3],[10,1,10,12],[11,1,11,12],[24,1,24,12],[21,1,21,12],[23,1,23,12],[27,1,27,4],[27,5,27,8],[22,1,22,12],[31,5,31,6],[31,7,31,8],[30,1,30,16],[12,14,12,15],[97,1,97,2],[99,1,99,2],[99,3,99,4],[96,1,96,2],[101,3,101,4],[96,5,96,6],[100,1,100,2],[97,7,98,8],[100,3,100,4],[96,7,96,8],[97,13,97,16],[102,13,102,16],[100,13,100,16],[100,5,102,6],[100,7,102,8],[98,13,98,16],[97,3,97,4],[98,3,98,4],[97,5,98,6],[93,2,93,3],[94,13,94,16],[95,1,95,8],[94,7,94,8],[88,15,88,16],[77,15,77,16],[39,15,39,16],[40,15,40,16],[40,5,40,6],[72,1,72,16],[68,15,68,16],[69,15,69,16],[67,7,67,8],[67,15,67,16],[39,7,39,8],[59,15,59,16],[60,15,60,16],[64,15,64,16],[63,10,63,11],[69,7,69,8],[65,7,65,8],[66,7,66,8],[64,10,64,11],[66,10,66,11]]}
[null,null,"ENERGY STAR"]
[null,null,"MULTIFAMILY HIGH RISE PROGRAM"]
[null,null,"Project Name: ",{"$f":"'Project Info'!C3","v":0}]
[]
[null,"LIGHTING - COMMON AREA, IN-UNIT, OUTDOOR & EMERGENCY LIGHTING - PROTOCOL 6.1-6.3",null,null,null,null,null,null,null,null,null,null,null,null,null,"Date:","Field Verified By:"]
[]
[]
[]
[]
[null,"Schedule:"]
[null,"1) Begin lighting inspections as early in the construction process as possible.  Verify make, manufacturer, ENERGY STAR certification, and rated wattage upon delivery or when lighting installations commence or during construction if earlier access (before ceiling closure) is needed to check circuiting layouts (e.g. for day lighting control). This will allow time for corrections before all of the fixtures have been installed."]
[null,"2) If possible, ask to have a sample installation completed for verification and testing before the electrician proceeds with all installations."]
[]
[null,"Equipment Needed"]
[null,"1) Lighting Schedule (with fixture type and lamp wattage)"]
[null,"2) Modeler's Lighting Schedule from Performance Path Calculator"]
[null,"3) Floor Plans (with fixture locations)"]
[null,"4) Contractor Submittals"]
[null,"6) Camera"]
[]
[null,"Sampling Requirements:"]
[null,"1)  Inspect 100% of unique common areas (basements, lobbies) with 24/7 lighting and follow the modified RESNET sampling protocol outlined in the How to Use this Manual section on page 11 of the T&V Protocols for similar, or repetitive spaces (stairwells, corridors, trash chute rooms, etc.)."]
[null,"2)  For all other spaces with non-24/7 lighting (apartments, storage rooms, mechanical rooms, etc.) follow the modified RESNET sampling protocol outlined in the How to Use this Manual section on page 11 of the T&V Protocols. This shall include, at a minimum, one representative apartment from each floor."]
[null,"3)  *PHOTOS REQUIRED*"]
[null,"-Take a photo of one sample of each fixture type with ENERGY STAR certification affixed, where applicable.\n- Photographs of CFLs must show if they are pin based.\n- Take a photo of each type of lighting control specified for each unique space (motion sensors, timers, and daylight sensors) .\n- If there are sensors in the stairwell and corridor, provide representative photo of each space and clearly label their location.\n- Provide photo showing bi-level lighting is installed (half the lamps on in a fixture, or all fixtures dimmed)\n- Exterior lighting with timers, provide a photo of the controls and provide lighting schedule that demonstrates hours of operation. \n- To document daylight sensor performance, take one photo showing the light fixture is off during the day and another photo showing the fixture is on when the daylight sensor is covered.\n- If measuring footcandles to demonstrate compliance with the Prerequisite, rather than calculating footcandles using the Performance Path Calculator, measurements should be taken in a sample of spaces, following the Sampling Protocols above. Provide photo-documentation of the light meter readings that demonstrate that IESNA light levels have been achieved.\n"]
[]
[null,"PROTOCOL",null,null,null,null,null,null,null,"PLAN REVIEW COMMENTS","LOCATION\ndwg / spec","PLAN REVIEW","INSPECTION","INSPECTION COMMENTS \n(Use this field to note problems, specific inspection details, or changes in As-Built compared to Design, like model numbers. If installed as designed, please state “Same as Design”. If make/model numbers have changed, list them here.)"]
[null,"Lighting Power Density and Illumination Levels\n• Include a schedule with manufacturer, model, total wattage, bulb type, control, location, and quantity of each type of lighting fixture.\n• Include location of fixtures on plans.\n• Type and wattage of fixtures and lamps on lighting schedule, specifications, and submittals shall match modeled power density in Proposed Design.\n• Assemble documentation from plans, specs and submittals.\n• Verify assumptions in the Proposed Design model or ensure that all of the requirements listed in the Prescriptive Path have been met.\n• Determine power density of each space by calculating the luminaire wattage as indicated in ASHRAE 90.1-2007, Section 9.1.4. ASHRAE 90.1-2007, Section 9.1.4a, requires that fixture wattage be calculated using the maximum labeled wattage of the fixture. EPA will allow light fixtures to be calculated based on the installed wattage of the lamps. Ex: A fixture with a 13 W screw-in CFL can be calculated as 13 W, plus any associated ballast power. See Appendix B of Performance or Prescriptive Path to determine input power.  \n• For spaces where installed light fixtures do not meet illumination requirements and occupants are expected to provide supplemental lighting (ie. bedrooms), assume the installed light fixture can illuminate at most 3 ft2 per Watt installed.\n• If following the Prescriptive Path, when calculating overall lighting power density, use 1.1 W/ft2 for spaces where lighting is not installed.\n• If following the Performance Path, verify that total installed lighting power for the combined non-apartment spaces does not exceed ASHRAE 90.1-2007 allowances for those combined spaces by more than 20%. If following the Prescriptive Path, verify that total installed lighting power for the combined non-apartment spaces does not exceed ASHRAE 90.1-2010 allowances for those combined spaces. Also, verify that the total specified exterior lighting power does not exceed ASHRAE 90.1-2010 allowances.Lighting controls may not be used to reduce the specified lighting power for compliance with this requirement.\n•If measuring footcandles to demonstrate compliance with the Prerequisite, rather than calculating footcandles, measurements shall be taken in a sample of spaces. Photo-documentation of the light-meter readings must be provided.\n",null,null,null,{"$f":"IF('Project Info'!C4='Project Info'!P35,'Prescriptive Path Checklist'!C111,IF('Project Info'!C4='Project Info'!P36,'Prerequisites Checklist'!C106,\"<Select compliance path on the 'Project Info' tab>\"))","v":"<Select compliance path on the 'Project Info' tab>"}]
[]
[null,"LIGHT FIXTURE SCHEDULE (To be completed prior to As-Built inspections and Submittals. Not required for Proposed Design Submittal)"]
[null,"*Copy data from Interior Lighting worksheet in Performance Path Calculator. Prescriptive Path projects must use that worksheet for LPD calculations. Insert rows as necessary*"]
[null,"FIXTURE CODE","LUMENS/WATT","WATTS/\nFIXTURE","FIXTURE TYPE","MANUFACTURER/\nMODEL",null,"GENERAL LOCATION",null,"ENERGY STAR? (Yes/No)","Notes","QTY","LOCATION\ndwg / spec","PLAN REVIEW","INSPECTION","INSPECTION COMMENTS \n(Use this field to note problems, specific inspection details, or changes in As-Built compared to Design, like model numbers. If installed as designed, please state “Same as Design”. If make/model numbers have changed, list them here.)"]
[]
[]
[]
[]
[]
[]
[]
[]
[]
[]
[]
[null,"COMMON AREA (To be completed prior to As-Built inspections and Submittals. Not required for Proposed Design Submittal):"]
[null,"*Copy data from Interior Lighting worksheet in Performance Path Calculator. Prescriptive Path projects must use that worksheet for LPD calculations. Insert rows as necessary*"]
[null,"FLOOR","SQUARE FOOTAGE","ROOM NAME","ASHRAE SPACE TYPE","RCR \nA=1, B=4, C=7","QTY","FIXTURE CODE \n(A, B, C, ETC.)","AUTO-MATIC LIGHTING CONTROLS?","FIXTURE INSTALLED WATTAGE","FLOOR MULTIPLIER","TOTAL INSTALLED WATTS","LOCATION\ndwg / spec","PLAN REVIEW","INSPECTION","INSPECTION COMMENTS \n(Use this field to note problems, specific inspection details, or changes in As-Built compared to Design, like model numbers. If installed as designed, please state “Same as Design”. If make/model numbers have changed, list them here.)"]
[null,null,null,null,null,null,null,null,null,{"$f":"VLOOKUP(H47,$B$33:$K$42,3,FALSE)","v":{"$error":"#N/A"}},null,{"$f":"G47*J47*K47","v":{"$error":"#N/A"}}]
[null,null,null,null,null,null,null,null,null,{"$error":"#N/A"},null,{"$error":"#N/A"}]
[null,null,null,null,null,null,null,null,null,{"$error":"#N/A"},null,{"$error":"#N/A"}]
[null,null,null,null,null,null,null,null,null,{"$error":"#N/A"},null,{"$error":"#N/A"}]
[null,null,null,null,null,null,null,null,null,{"$error":"#N/A"},null,{"$error":"#N/A"}]
[null,null,null,null,null,null,null,null,null,{"$error":"#N/A"},null,{"$error":"#N/A"}]
[null,null,null,null,null,null,null,null,null,{"$error":"#N/A"},null,{"$error":"#N/A"}]
[null,null,null,null,null,null,null,null,null,{"$error":"#N/A"},null,{"$error":"#N/A"}]
[null,null,null,null,null,null,null,null,null,{"$error":"#N/A"},null,{"$error":"#N/A"}]
[null,null,null,null,null,null,null,null,null,{"$error":"#N/A"},null,{"$error":"#N/A"}]
[null,null,null,null,null,null,null,null,null,{"$error":"#N/A"},null,{"$error":"#N/A"}]
[null,null,null,null,null,null,null,null,null,{"$error":"#N/A"},null,{"$error":"#N/A"}]
[null,null,null,null,null,null,null,null,null,{"$error":"#N/A"},null,{"$error":"#N/A"}]
[null,null,null,null,null,null,null,null,null,{"$error":"#N/A"},null,{"$error":"#N/A"}]
[null,null,null,null,null,null,null,null,null,{"$error":"#N/A"},null,{"$error":"#N/A"}]
[null,"EXTERIOR (To be completed prior to As-Built inspections and Submittals. Not required for Proposed Design Submittal):"]
[null,"*Copy data from Exterior Lighting worksheet in Performance Path Calculator. Prescriptive Path projects must use that worksheet for LPD calculations. Insert rows as necessary*"]
[null,"Space",null,null,"LIT AREA","Linear or Square Feet? ","INSTALLED \nQTY","FIXTURE CODE \n(A, B, C, ETC.)",null,"FIXTURE INSTALLED WATTAGE","TOTAL INSTALLED WATTAGE",null,"LOCATION\ndwg / spec","PLAN REVIEW","INSPECTION","INSPECTION COMMENTS \n(Use this field to note problems, specific inspection details, or changes in As-Built compared to Design, like model numbers. If installed as designed, please state “Same as Design”. If make/model numbers have changed, list them here.)"]
[null,null,null,null,null,null,null,null,null,{"$f":"VLOOKUP(H65,$B$33:$K$42,3,FALSE)","v":{"$error":"#N/A"}},{"$f":"G65*J65","v":{"$error":"#N/A"}}]
[null,null,null,null,null,null,null,null,null,{"$error":"#N/A"},{"$error":"#N/A"}]
[null,null,null,null,null,null,null,null,null,{"$error":"#N/A"},{"$error":"#N/A"}]
[null,null,null,null,null,null,null,null,null,{"$error":"#N/A"},{"$error":"#N/A"}]
[null,null,null,null,null,null,null,null,null,{"$error":"#N/A"},{"$error":"#N/A"}]
[null,null,null,null,null,null,null,null,null,{"$error":"#N/A"},{"$error":"#N/A"}]
[]
[null,"APARTMENTS (To be completed prior to As-Built inspections and Submittals. Not required for Proposed Design Submittal):"]
[null,"*Copy data from In-Unit Lighting worksheet in Performance Path Calculator. Prescriptive Path projects must use that worksheet for LPD calculations. Insert rows as necessary*"]
[null,"FLOOR","ROOM NAME","ROOM AREA SF","INSTALLED QUANTITY","FIXTURE CODE \n(A, B, C, ETC.)","FIXTURE INSTALLED WATTS","TEF","# OF ROOMS \nIN THE BLDG","TOTAL AREA, SF","TOTAL INSTALLED WATTAGE","ILLUMINATION (FOOTCANDLES OR LUMENS/SF)","LOCATION\ndwg / spec","PLAN REVIEW","INSPECTION","INSPECTION COMMENTS \n(Use this field to note problems, specific inspection details, or changes in As-Built compared to Design, like model numbers. If installed as designed, please state “Same as Design”. If make/model numbers have changed, list them here.)"]
[null,null,null,null,null,null,{"$f":"VLOOKUP(F75,$B$33:$K$42,3,FALSE)","v":{"$error":"#N/A"}},null,null,{"$f":"D75*I75","v":0},null,{"$f":"IF(H75>0, E75*H75/D75, \"0.0\")","v":"0.0"}]
[null,null,null,null,null,null,{"$error":"#N/A"},null,null,{"$f":"D76*I76","v":0},{"$f":"E76*I76*G76","v":{"$error":"#N/A"}},{"$f":"IF(H76>0, E76*H76/D76, \"0.0\")","v":"0.0"}]
[null,null,null,null,null,null,{"$error":"#N/A"},null,null,{"$f":"D77*I77","v":0},{"$error":"#N/A"},{"$f":"IF(H77>0, E77*H77/D77, \"0.0\")","v":"0.0"}]
[null,null,null,null,null,null,{"$error":"#N/A"},null,null,0,{"$error":"#N/A"},"0.0"]
[null,null,null,null,null,null,{"$error":"#N/A"},null,null,0,{"$error":"#N/A"},"0.0"]
[null,null,null,null,null,null,{"$error":"#N/A"},null,null,0,{"$error":"#N/A"},"0.0"]
[null,null,null,null,null,null,{"$error":"#N/A"},null,null,0,{"$error":"#N/A"},"0.0"]
[null,null,null,null,null,null,{"$error":"#N/A"},null,null,0,{"$error":"#N/A"},"0.0"]
[null,null,null,null,null,null,{"$error":"#N/A"},null,null,0,{"$error":"#N/A"},"0.0"]
[null,null,null,null,null,null,{"$error":"#N/A"},null,null,0,{"$error":"#N/A"},"0.0"]
[null,null,null,null,null,null,{"$error":"#N/A"},null,null,0,{"$error":"#N/A"},"0.0"]
[null,null,null,null,null,null,{"$error":"#N/A"},null,null,0,{"$error":"#N/A"},"0.0"]
[null,null,null,null,null,null,{"$error":"#N/A"},null,null,0,{"$error":"#N/A"},"0.0"]
[null,null,null,null,null,null,{"$error":"#N/A"},null,null,0,{"$error":"#N/A"},"0.0"]
[null,null,null,null,null,null,{"$error":"#N/A"},null,null,0,{"$error":"#N/A"},"0.0"]
[]
[null,null,"Fixture Count",null,"TOTAL","ENERGY STAR","> 80%?"]
[null,null,"Apartment",null,{"$f":"SUMIF($H$33:$I$42, C92, $L$33:$L$42)","v":0},{"$f":"SUMIFS($L$33:$L$42, $H$33:$H$42, C92, $J$33:$J$42, \"Yes\")","v":0},{"$f":"F92/E92","v":{"$error":"#DIV/0!"}}]
[null,null,"Common Space",null,{"$f":"SUMIF($H$33:$I$42, C93, $L$33:$L$42)","v":0},{"$f":"SUMIFS($L$33:$L$42, $H$33:$H$42, C93, $J$33:$J$42, \"Yes\")","v":0},{"$f":"F93/E93","v":{"$error":"#DIV/0!"}}]
[null,null,"Exterior",null,{"$f":"SUMIF($H$33:$I$42, C94, $L$33:$L$42)","v":0},{"$f":"SUMIFS($L$33:$L$42, $H$33:$H$42, C94, $J$33:$J$42, \"Yes\")","v":0},{"$f":"F94/E94","v":{"$error":"#DIV/0!"}}]
[null,"PROTOCOL",null,"PATH REQUIREMENT",null,"PROPOSED ERM",null,"ENERGY MODEL",null,"PLAN REVIEW COMMENTS","LOCATION\ndwg / spec","PLAN REVIEW","INSPECTION","INSPECTION COMMENTS \n(Use this field to note problems, specific inspection details, or changes in As-Built compared to Design, like model numbers. If installed as designed, please state “Same as Design”. If make/model numbers have changed, list them here.)"]
[null,"Compliance Statement\n• All lighting systems are consistent with the project specifications and Proposed Design model or meets or exceeds the requirements listed in the Prescriptive Path.\n"]
[null,"Lighting Controls - Verification\n• Specify operational sensitivity settings (adjust so lights turn on when occupant enters controlled area, but remain off while unoccupied, i.e. unaffected by HVAC and VAV systems, etc.) and shut-off delay period (5 minutes or owner preference).\n• Specify power settings (as low as possible while still meeting any code requirements).\n• Include type and count of controls and associated fixtures in lighting schedule.\n• Note all locations of sensors on plans, and indicate which fixtures each sensor controls.\n• Check location of control types for conformance/deviation and count total number of controls in that space. \n• Confirm that each control type is operable:\n• For occupancy sensors, step in and out of the zone, check for blind spots\n• For timers, set timer to current time and confirm control of fixture.\n• For photocells, cover or black-out photocell and confirm control of fixture.\n• For day lighting controls, dim or black-out location to observe change in fixture light level.\n• For occupancy dimmers, check lower power limit and on-time settings.",null,{"$f":"IF('Project Info'!C4='Project Info'!P35,'Prescriptive Path Checklist'!C103,IF('Project Info'!C4='Project Info'!P36,'Prerequisites Checklist'!C99,\"<Select compliance path on the 'Project Info' tab>\"))","v":"<Select compliance path on the 'Project Info' tab>"},null,{"$f":"ERMs!C47","v":0},null,{"$f":"ERMs!D47","v":0}]
[null,"Common Area Lighting (Including Garages) - ENERGY STAR\n• Check quantity, locations, unit specifications for conformance/deviation with ENERGY STAR certification, where applicable.\n• Collect manufacturer and model data to verify lighting system is consistent with the project specifications and Proposed Design model or meets or exceeds the requirements listed in the Prescriptive Path.\n• Take a photo of one sample of each fixture type with ENERGY STAR certification affixed, where applicable. \n• Collect submittals/invoices for each unique fixture type showing ENERGY STAR certification (where applicable) and wattage.",null,{"$f":"IF('Project Info'!C4='Project Info'!P35,'Prescriptive Path Checklist'!C104,IF('Project Info'!C4='Project Info'!P36,'Prerequisites Checklist'!C100,\"<Select compliance path on the 'Project Info' tab>\"))","v":"<Select compliance path on the 'Project Info' tab>"},null,{"$f":"ERMs!C48","v":0},null,{"$f":"ERMs!D48","v":0}]
[null,"Common Area Lighting (Including Garages) - LPD\n• Check quantity, locations, unit specifications for conformance/deviation including types of fixtures, wattages of lamps, etc.\n",null,{"$f":"IF('Project Info'!C4='Project Info'!P35,'Prescriptive Path Checklist'!C105,IF('Project Info'!C4='Project Info'!P36,'Prerequisites Checklist'!C101,\"<Select compliance path on the 'Project Info' tab>\"))","v":"<Select compliance path on the 'Project Info' tab>"}]
[null,"Emergency Lighting - Exit Signs\n• All exit signs shall be specified as LED (not to exceed 5W per face) or photo-luminescent and shall conform to local building code. \n• Fixtures located above stairwell doors and other forms of egress shall contain a battery back-up feature.\n",null,{"$f":"IF('Project Info'!C4='Project Info'!P35,'Prescriptive Path Checklist'!C106,IF('Project Info'!C4='Project Info'!P36,'Prerequisites Checklist'!C102,\"<Select compliance path on the 'Project Info' tab>\"))","v":"<Select compliance path on the 'Project Info' tab>"},null,{"$f":"ERMs!C49","v":0},null,{"$f":"ERMs!D49","v":0}]
[null,"Exterior Lighting - Controls\n• Include type and count of controls and associated fixtures in lighting schedule.\n• Note all locations of sensors on plans, and indicate which fixtures each sensor controls.\n• Check location of control types for conformance/deviation. \n• Confirm that each control type is operable, see above for detailed instructions. \n• For timers, set timer to current time and confirm control of fixture.\n• For photocells, cover or black-out photocell and confirm control of fixture.",null,{"$f":"IF('Project Info'!C4='Project Info'!P35,'Prescriptive Path Checklist'!C107,IF('Project Info'!C4='Project Info'!P36,'Prerequisites Checklist'!C103,\"<Select compliance path on the 'Project Info' tab>\"))","v":"<Select compliance path on the 'Project Info' tab>"},null,{"$f":"ERMs!C50","v":0},null,{"$f":"ERMs!D50","v":0}]
[null,"Exterior Lighting - ENERGY STAR\n• Check quantity, locations, unit specifications for conformance/deviation with ENEGY STAR certification, where applicable.\n• Collect manufacturer and model data to verify lighting system is consistent with the project specifications and Proposed Design model or meets or exceeds the requirements listed in the Prescriptive Path.\n• Take a photo of one sample of each fixture type with ENERGY STAR certification affixed, where applicable. \n• Collect submittals/invoices for each unique fixture type showing ENERGY STAR certification (where applicable) and wattage.",null,{"$f":"IF('Project Info'!C4='Project Info'!P35,'Prescriptive Path Checklist'!C108,IF('Project Info'!C4='Project Info'!P36,'Prerequisites Checklist'!C104,\"<Select compliance path on the 'Project Info' tab>\"))","v":"<Select compliance path on the 'Project Info' tab>"}]
[null,"Exterior Lighting - LPD (Prescriptive Path)\n• Check quantity, locations, unit specifications for conformance/deviation including types of fixtures, wattages of lamps, etc.",null,{"$f":"IF('Project Info'!C4='Project Info'!P35,'Prescriptive Path Checklist'!C109,IF('Project Info'!C4='Project Info'!P36,\"N/A\",\"<Select compliance path on the 'Project Info' tab>\"))","v":"<Select compliance path on the 'Project Info' tab>"}]
[null,"In-Unit Lighting  \n• Check quantity, locations, unit specifications for conformance/deviation including types of fixtures, wattages of lamps, etc.\n• Collect manufacturer and model data to verify lighting system is consistent with the project specifications and Proposed Design model or meets or exceeds the requirements listed in the Prescriptive Path.\n• Take a photo of one sample of each fixture type with ENERGY STAR certification affixed, where applicable. \n• Collect submittals/invoices for each unique fixture type showing ENERGY STAR certification (where applicable) and wattage.",null,{"$f":"IF('Project Info'!C4='Project Info'!P35,'Prescriptive Path Checklist'!C110,IF('Project Info'!C4='Project Info'!P36,'Prerequisites Checklist'!C105,\"<Select compliance path on the 'Project Info' tab>\"))","v":"<Select compliance path on the 'Project Info' tab>"},null,{"$f":"ERMs!C51","v":0},null,{"$f":"ERMs!D51","v":0}]
[null,"Lighting - Ballasts\n• Fixtures specified with electronic ballasts must be confirmed in the field using an electronic ballast tester."]
[null,"Lighting - Statement of Substantial Completion - Non 24/7 Spaces\n• A Statement of Substantial Completion or approved proxy must be used to establish completion of the work associated in all spaces with lighting not operating 24/7 associated with this protocol. A Statement of Substantial Completion is to be completed by the installation contractor or other qualified representative on company letterhead, complete with all information, photographs, cut sheets, etc., required in this protocol and in the corresponding T&V Worksheet."]
[null,"Lighting - Statement of Substantial Completion - 24/7 Spaces\n• A Statement of Substantial Completion or approved proxy may be used to establish completion of all other work associated with this protocol. A Statement of Substantial Completion is to be completed by the installation contractor or other qualified representative on company letterhead, complete with all information, photographs, cut sheets, etc., required in this protocol and in the corresponding T&V Worksheet."]
[]
[]
[]
[]
[null,null,null,null,null,null,null,null,null,null,null,null,null,null,null,null,null,null,null,null,"Yes"]
[null,null,null,null,null,null,null,null,null,null,null,null,null,null,null,null,null,null,null,null,"No"]
[null,null,null,null,null,null,null,null,null,null,null,null,null,null,null,null,null,null,null,null,"N/A"]

{"sheet":"7.1 - MOTORS","index":21,"n_rows":46,"n_cols":17,"rows_kept":46,"cut":false,"hidden":false,"merged":[[21,7,21,8],[11,1,11,4],[40,1,40,12],[9,1,9,8],[10,11,10,12],[9,11,9,12],[9,9,9,10],[11,9,11,10],[10,1,10,8],[18,1,18,12],[11,11,11,12],[20,1,20,10],[10,9,10,10],[36,1,36,10],[35,7,35,8],[22,1,22,6],[7,11,7,12],[8,1,8,8],[8,9,8,10],[8,11,8,12],[7,1,7,8],[7,9,7,10],[39,1,39,12],[37,1,37,10],[38,1,38,10],[22,7,22,8],[35,3,35,4],[34,7,34,8],[35,1,35,2],[33,1,33,2],[32,7,32,8],[34,1,34,2],[34,3,34,4],[33,3,33,4],[33,7,33,8],[23,1,23,9],[6,1,6,4],[6,9,6,10],[6,11,6,12],[4,11,4,12],[5,1,5,4],[5,9,5,10],[5,11,5,12],[4,9,4,10]]}
[null,null,"ENERGY STAR"]
[null,null,"MULTIFAMILY HIGH RISE PROGRAM"]
[null,null,"Project Name: ",{"$f":"'Project Info'!C3","v":0}]
[]
[null,"HVAC - MOTORS - PROTOCOL 7.1",null,null,null,null,null,null,null,"Date:",null,"Field Verified By:"]
[]
[null,"Schedule:"]
[null,"1) The developer or GC shall ensure that deliveries are inspected prior to accepting them to verify that product substitutions by the distributor or manufacturer have not resulted in motors with lower efficiencies than those in the Proposed Design."]
[null,"2) Minimum of one on-site inspection required, preferably immediately after installation so that corrective action can be taken if necessary.  Delivery tickets may be used to verify complete shipments but on-site inspections of a sample of installed motors is required."]
[null,"3) Commissioning is conducted upon completion of the installation of the system."]
[null,"4) Training shall occur following installation of the system and completion of all quality assurance and verification procedures."]
[]
[null,"Equipment Needed"]
[null,"1) Commissioning Report"]
[null,"2) Mechanical Schedule and Floor Plans"]
[null,"3) Camera"]
[]
[null,"Sampling Requirements:"]
[null,"1)  100% of motors over 1 HP and all those servicing primary HVAC equipment (e.g. heating/cooling plants, domestic water heating systems, etc.) shall be inspected in the quality assurance and verification process."]
[null,"2) *PHOTOS REQUIRED* "]
[null,"- Photograph faceplate; and NEMA Premium label (if applicable) of one representative motor of each size. Given the number of motors and pumps in any given building make sure to clearly identify location and use of each motor represented."]
[null,"NOTES FOR DRAWINGS AND SPECIFICATIONS",null,null,null,null,null,"PLAN REVIEW COMMENTS",null,"LOCATION\n(dwg/spec)","PLAN REVIEW"]
[null,"• All three-phase pump motors 1 horse-power or larger shall meet or exceed efficiency standards for NEMA Premium™ motors. Note: Motors that are packaged as an integral component of mechanical equipment, as well as motors in fire and fresh water booster pumps are exempt from this requirement.\n• If following the Prescriptive Path, Motors 5 horse-power or larger for circulating pumps serving hydronic heating or cooling systems must be specified with variable frequency drives.\n• Motor size, type, design, and rated efficiency shall match assumptions made in the Proposed Design model or meet or exceed the requirements listed in the Prescriptive Path.\n\n"]
[null,"Motor Schedule: \nRecord manufacturer and model number of all non-ventilation motors over 1 HP (ventilation motors are covered in the ventilation section, Protocol 8.2 - Common Area and In-Unit Ventilation (CFM), Intake Source, and Intake/Exhaust Fan Efficiency)."]
[null,"ID","DESCRIPTION","LOCATION","QUANTITY","MFR","MODEL #","HORSE\nPOWER (HP)","ENERGY STAR / NEMA PREMIUM","LOCATION\n(dwg/spec)","PLAN REVIEW","INSPECTION","INSPECTION COMMENTS \n(Use this field to note problems, specific inspection details, or changes in As-Built compared to Design, like model numbers. If installed as designed, please state “Same as Design”. If make/model numbers have changed, list them here.)\n"]
[]
[]
[]
[]
[]
[]
[]
[null,"PROTOCOL",null,"PATH REQUIREMENT",null,"PROPOSED \nERM","ENERGY \nMODEL","PLAN REVIEW COMMENTS",null,"LOCATION\n(dwg/spec)","PLAN REVIEW","INSPECTION","INSPECTION COMMENTS \n(Use this field to note problems, specific inspection details, or changes in As-Built compared to Design, like model numbers. If installed as designed, please state “Same as Design”. If make/model numbers have changed, list them here.)\n"]
[null,"Heating Distribution - Motors\n• Confirm manufacturer and model number is NEMA Premium* labeled and/or complies with minimum performance criteria established by that program.",null,{"$f":"IF('Project Info'!C4='Project Info'!P35,'Prescriptive Path Checklist'!C113,IF('Project Info'!C4='Project Info'!P36,'Prerequisites Checklist'!C108,\"<Select compliance path on the 'Project Info' tab>\"))","v":"<Select compliance path on the 'Project Info' tab>"},null,{"$f":"ERMs!C53","v":0},{"$f":"ERMs!D53","v":0}]
[null,"Cooling Distribution - Motors\n• Confirm manufacturer and model number is NEMA Premium* labeled and/or complies with minimum performance criteria established by that program.",null,{"$f":"IF('Project Info'!C4='Project Info'!P35,'Prescriptive Path Checklist'!C114,IF('Project Info'!C4='Project Info'!P36,'Prerequisites Checklist'!C109,\"<Select compliance path on the 'Project Info' tab>\"))","v":"<Select compliance path on the 'Project Info' tab>"},null,{"$f":"ERMs!C54","v":0},{"$f":"ERMs!D54","v":0}]
[null,"DHW Distribution - Motors\n• Confirm manufacturer and model number is NEMA Premium* labeled and/or complies with minimum performance criteria established by that program.",null,{"$f":"IF('Project Info'!C4='Project Info'!P35,'Prescriptive Path Checklist'!C115,IF('Project Info'!C4='Project Info'!P36,'Prerequisites Checklist'!C110,\"<Select compliance path on the 'Project Info' tab>\"))","v":"<Select compliance path on the 'Project Info' tab>"},null,{"$f":"ERMs!C55","v":0},{"$f":"ERMs!D55","v":0}]
[null,"Motors- Manufacturer's Product Data\n• Review manufacturer’s cut sheets or invoice verifying  motor size and efficiency."]
[null,"Motors - Training and Manuals\n• EPA recommends confirming that all applicable operating and specification manuals are delivered to the building staff. EPA also recommends verifying that staff members have been trained and are aware of their responsibilities to maintain and operate the systems properly. Summarize any training performed and personnel involved."]
[null,"Statement of Substantial Completion\n• A Statement of Substantial Completion or approved proxy may be used to establish completion of the work associated with this protocol. A Statement of Substantial Completion is to be completed by the installation contractor or other qualified representative on company letterhead, complete with all information, photographs, cut sheets, etc., required in this protocol and in the corresponding T&V Worksheet."]
[null,"*Many motors are NEMA labeled and this label alone, does not ensure that a motor is energy-efficient.  This requirement refers specifically to the NEMA Premium energy efficient motors program.  Participating companies may be found at "]
[null,"http://www.nema.org/Policy/Energy/Efficiency/Documents/NEMA_Premium_Partners.pdf "]
[]
[]
[null,null,null,null,null,null,null,null,null,null,null,null,null,null,null,null,"Yes"]
[null,null,null,null,null,null,null,null,null,null,null,null,null,null,null,null,"No"]
[null,null,null,null,null,null,null,null,null,null,null,null,null,null,null,null,"N/A"]

{"sheet":"8.1 - INF_EXT AIR BARRIER","index":22,"n_rows":79,"n_cols":14,"rows_kept":79,"cut":false,"hidden":false,"merged":[[30,1,30,4],[50,1,50,4],[10,1,10,6],[11,1,11,6],[32,1,32,4],[24,1,24,6],[25,1,25,6],[26,1,26,6],[31,1,31,4],[22,1,22,6],[45,2,45,4],[33,6,43,6],[23,1,23,6],[4,7,4,8],[5,7,5,8],[6,7,6,8],[13,1,13,6],[9,1,9,6],[7,1,7,6],[8,1,8,6],[7,7,7,8],[8,7,8,8],[12,1,12,6],[55,1,55,4],[53,1,53,4],[27,1,27,6],[28,1,28,6],[62,1,62,4],[57,1,57,4],[59,1,59,4],[56,1,56,4],[58,1,58,4],[47,1,47,4],[48,1,48,4],[46,2,46,4],[49,1,49,4],[52,1,52,4],[54,1,54,4],[51,1,51,4],[66,1,66,4],[60,1,60,4],[63,1,63,4],[71,1,71,4],[67,1,67,4],[68,1,68,4],[69,1,69,4],[70,1,70,4],[61,1,61,4],[65,1,65,4],[64,1,64,4]]}
[null,null,"ENERGY STAR"]
[null,null,"MULTIFAMILY HIGH RISE PROGRAM"]
[null,null,"Project Name: ",{"$f":"'Project Info'!C3","v":0}]
[]
[null,"ENVELOPE - EXTERIOR AIR BARRIER - PROTOCOL 3.1 & 8.1",null,null,null,null,null,"Date:",null,"Field Verified By:"]
[]
[null,"Schedule:"]
[null,"This process begins with the construction documentation.  A minimum of 3-5 site visits are recommended to properly inspect air sealing details. Each exterior, common area and in-unit element on the air sealing checklists must be inspected at each of the following stages to ensure use of proper materials and complete seals exist for each juncture or penetration:\n"]
[null,"1) Window/Wall Mock Up Inspection (If applicable)"]
[null,"2) Load-bearing wall and slab-edge/rim-joist inspection:  air/vapor/weather barrier prior to enclosure"]
[null,"3) Pre-drywall visual inspection of penetrations"]
[null,"4) Sample apartment inspection and blower door test "]
[null,"5) Post-correction testing of sample apartment"]
[null,"6) Final inspection and testing of apartments post completion\n"]
[null,"\n"]
[null,"Equipment Needed"]
[null,"1) Camera"]
[null,"2) Measuring Tape or ruler"]
[null,"3) Floor Plans"]
[null,"4) Relevant Wall and Window Sections and Details"]
[]
[null,"Sampling Requirements:"]
[null,"1) Each unique wall assembly shall be inspected.  (For example:  if the basement walls are constructed differently from the upper floors, both areas must be inspected independently; also, if insulation specifications are different for living areas vs. common areas or other special use areas, each different specification shall be inspected independently.)"]
[null,"2) Sampling may be used to inspect wall assemblies that are consistent throughout large sections of the building.  Inspections done from the exterior shall sample at least 15% of each wall area.  For inspections done from interior spaces, follow the modified RESNET sampling protocol outlined in the How to Use this Manual section on page 11 of the T&V Protocols, for each unique wall type.  In addition, the sample set must include, at a minimum, all unique assemblies.  If problems are found in the sample set, additional inspections must be conducted to determine the full extent of the problems and to ensure that repairs are completed in all areas of the building where they are needed."]
[null,"3)  For elements that provide central services to the building (i.e. entry doors, central duct chases, utility service penetrations, etc.) a minimum 50% sample shall be inspected.  For elements that are repeated throughout the building or occur in every living unit (i.e. windows, wall/floor connections, air conditioner sleeves, etc.) follow RESNET sampling protocol.  If problems are identified, additional units must be inspected to determine if the problems are systemic so an appropriate repair order can be issued."]
[null,"4) Documentation of post-repair conditions is required for correction of problems that represent large surface areas (greater than 50 square feet) and/or systemic problems (e.g. all corner units are insulated improperly).  On-site inspection to verify corrections is preferable, but if this is not possible/practical due to construction schedules, photographic documentation of repairs submitted to the responsible party by the GC are an acceptable alternative."]
[null,"5) *PHOTOS REQUIRED*"]
[null,"Provide one representative photograph of continuous air barrier at all types of typical joints, junctions, and general coverage areas to include the following at a minimum:"]
[null,"5a) Inspected from the exterior: Areas with liquid-applied membranes showing appropriate thickness; AC openings; Windows, Door openings, and Door frame; Transition between wall and roof barrier; Transition between wall and foundation barrier; Plank/Slab Edge (Masonry and Steel Construction) or Rim Joist (Wood Framed Construction)\n5b)  Inspected from the interior: Rough openings to windows and doors, AC openings"]
[null,"NOTES FOR DRAWINGS AND SPECIFICATIONS",null,null,null,"PLAN REVIEW COMMENTS","LOCATION\ndwg / spec","PLAN REVIEW"]
[null,"General Exterior Enclosure: \n• The construction drawings and specifications must clearly identify systems that manage the flow of rainwater (e.g. cladding, air gap and weather resistant barrier), heat (insulation) and air (air barriers) through the exterior enclosure.  Continuity of these three systems must be shown in section, plan and details.  Typical sections must show continuity from the center of the roof assembly, down the walls and fenestration, to the center of the foundation floor.  Submittal of shop drawings detailing continuity of these systems and installer qualifications must be required in the specifications.\n• Exterior enclosure assemblies must be designed and constructed to prevent condensation within the assemblies during heating mode, cooling mode or both as the climate dictates.  Assemblies may be drawn from published guidance documents that include hygro-thermal performance analysis.  Alternatively assemblies should pass year – long, hourly hygro-thermal simulations conducted in accordance with ASHRAE 160P."]
[null,"Exterior Enclosure Air barriers:\n• Bid and contract documents must demonstrate a continuous, unbroken air barrier separating the conditioned space of the building from the exterior, unconditioned spaces within the building, mechanical rooms vented with conditioned air, mechanical chases opening to unconditioned spaces, elevator shafts and garages or other vehicle/equipment storage facilities.   All air barrier materials must be compatible with other air barrier elements to which they connect.\n• Bid and contract documents must include detailed information that shows the air barrier continuity through the various conditions of the exterior enclosure (e.g., transitions between dissimilar materials and penetrations) and that serves as an index to relevant details.\n• Include list of elements to be sealed in construction documents.  List must include all elements identified in ASHRAE 90.1-2007, Section 5.4.3.1, or applicable state code, all elements listed in the Prerequisites Checklist, and any additional site-specific elements identified during plan review that shall be addressed to ensure air leakage in the exterior building envelope is effectively controlled.  Bid and contract documents must include locations to be sealed as well as acceptable methods and materials.\n• When feasible all air barriers membranes and accessories (transition membranes, flashing membranes, mastics, sealants, primers and tapes) will be from the same manufacturer. When products from a variety of manufacturers are used, a letter must be obtained from at least one manufacturer of the products in contact stating the materials proposed for use are permanently chemically compatible and adhesively compatible with adjacent materials proposed for use. Gaps and joints must be primed and sealed with transition membrane, tape or sealant that is rated to withstand the thermal and structural deflection calculated for the joint in question. For joints that are anticipated to have more than ½” deflection, special details are needed to allow flexibility.\n• Specifications could include, at the discretion of the developer, the inspection of a sample mock-up installation by the responsible party prior to installation of windows building-wide."]
[null,"WALL TYPE:  This section can be duplicated, copy and insert rows",null,null,null,"PLAN REVIEW COMMENTS","LOCATION\ndwg / spec","PLAN REVIEW","INSPECTION","INSPECTION COMMENTS \n(Use this field to note problems, specific inspection details, or changes in As-Built compared to Design, like model numbers. If installed as designed, please state “Same as Design”. If make/model numbers have changed, list them here.)\n"]
[null,"Air Barrier Component",null,null,"Fluid applied air barrier membrane"]
[null,null,null,null,"Self-adhering air barrier membrane"]
[null,null,null,null,"Mechanically attached air barrier membrane"]
[null,null,null,null,"Board stock air barrier"]
[null,null,null,null,"Spray applied polyurethane insulation"]
[null,null,null,null,"Gypsum board, CMU or foam board substrate"]
[null,null,null,null,"Sealants"]
[null,null,null,null,"Primer"]
[null,null,null,null,"Mastic"]
[null,null,null,null,"Transition membrane"]
[null,null,null,null,"Tapes"]
[]
[null,"PROTOCOL","PATH REQUIREMENT",null,null,"PLAN REVIEW COMMENTS","LOCATION\ndwg / spec","PLAN REVIEW","INSPECTION","INSPECTION COMMENTS \n(Use this field to note problems, specific inspection details, or changes in As-Built compared to Design, like model numbers. If installed as designed, please state “Same as Design”. If make/model numbers have changed, list them here.)\n"]
[null,"Compliance Statement\n• Assembly is consistent with the project specifications and Proposed Design model or meets or exceeds the requirements listed in the Prescriptive Path.\n\nAll air barrier materials must be compatible with other air barrier elements to which they connect.\n\n• Gaps and joints must be primed and sealed with transition membrane, tape or sealant that is rated to withstand the thermal and structural deflection calculated fort the joint in question. For joints that are anticipated to have more than ½” deflection special details are needed to allow flexibility.\n",{"$f":"IF('Project Info'!C4='Project Info'!P35,'Prescriptive Path Checklist'!C117,IF('Project Info'!C4='Project Info'!P36,'Prerequisites Checklist'!C112,\"<Select compliance path on the 'Project Info' tab>\"))","v":"<Select compliance path on the 'Project Info' tab>"}]
[null,"Wood-Framed Construction  (RECOMMENDED, NOT A PREREQUISITE)\n• For wood-framed construction, Version 3.0 of the ENERGY STAR Qualified Homes Thermal Enclosure System Rater Checklist Sections 3 and 5 is recommended in addition to all applicable T&V Protocols."]
[null,"Masonry Wall Preparation\n• Gaps are filled, Joints struck, CMU is dry, all snags are gone."]
[null,"Gypsum Board Sheathing Wall Preperation\n• Gaps and joints primed and sealed with appropriate transition membrane or tape that is rated to withstand the thermal and structural deflection calculated for the joint in question\n• Edges of transition membrane or tape (termination seams) sealed with compatible sealant where not sealed by liquid membrane\n• Air barrier applied in accordance with manufacturer’s instructions."]
[null,"General Coverage - Liquid Membrane\n• Verify proper thickness of liquid-applied membranes using a wet mil gauge; at a minimum, substrate must not be visible."]
[null,"General Coverage at Adjacent Building Conditions - Liquid Membrane\n• Where unable to install air barrier on the exterior of the building, a low VOC product shall be installed on the interior at full height (top of plank to bottom of plank at each floor). This shall happen before any interior framing is installed."]
[null,"General Coverage / Transition Membrane - Seams\n• All transition membranes should be installed and sealed before insulation is installed on top. Seams shall be sealed per manufacturer’s instructions."]
[null,"Air Barrier Penetrations\n• Post air barrier penetrations shall be sealed per air barrier manufacturer’s requirement.  Transition membranes shall be used to patch as necessary with seams sealed appropriately."]
[null,"Rough Openings (Concrete Masonry Construction) - Windows and Doors\n• Liquid air barrier shall wrap in at masonry rough openings to be flush with inside edge of window or door frame.\n• Sheet membrane or metal panel enclosure can be used as alternative as long as it is clear the air barrier is continuous and any gaps are sealed per manufacturer’s instructions with backer rod as necessary.\n"]
[null,"Rough Openings (Steel Stud Construction) - Windows and Doors\n• Rough opening must be wrapped with sheet membrane all the way inside to be flush with inside edge."]
[null,"Rough Openings - Pipes, Conduits, Ducts, Etc.\n• Gaps shall be filled with backer rod as necessary and sealant compatible with all surfaces (Where smooth surfaces are present, mechanical gasket seals can be used). EPA recommends using a minimum 20 year sealant."]
[null,"Rough Openings - Cast Stone Sills\n• Cast stone sill shall be sealed to sill pan. EPA recommends using minimum 20 year compatible sealant where not sealed by grout."]
[null,"Rough Openings - Gap at Window Frames\n• Gaps between window frame (header, jambs, sill) and rough opening shall be sealed on the interior with backer rod as necessary and sealant that is compatible with all surfaces applied to.  EPA recommends using a minimum 20 year sealant."]
[null,"Rough Openings - Gap at Exterior Door Frames\n• Gaps between door frame (header, jambs, threshold) and rough opening shall be sealed on the interior with backer rod as necessary and sealant that is compatible with all surfaces applied to. EPA recommends using a minimum 20 year sealant."]
[null,"Rough Openings - A/C Sleeves\n• Gaps between A/C sleeves and rough openings to be sealed on the interior with backer rod as necessary and sealant that is compatible with all surfaces applied to. EPA recommends using a minimum 20 year sealant. Insulated interior cover with air tight compressible gasket must be provided."]
[null,"Doors - Weather-stripping\n• When required by local building code, verify entranceways contain vestibules with weather-stripping hard-fastened to the door or frame.\n• Weather-stripping is mandatory at doors between conditioned spaces and the exterior; unconditioned spaces; and spaces vented to the outside.\n• Weather-stripping is recommended, but not required, at doors between corridors and stairwells; between apartments and corridors; and doors leading to mechanical rooms. \n• Weather-stripping at mandatory locations shall be installed with a rigid fastener and replaceable foam gasket specified for durability and less maintenance."]
[null,"Plank Edges (Steel Stud Construction) - At plank / exterior sheathing joint\n• Transition Membrane must be installed over top spanning  the sheathing / plank edge joint creating a bellows with backer rod\n• All termination seams must be sealed with compatible sealant. EPA recommends using a minimum 20 year sealant. \n"]
[null,"Plank Edges (Concrete Masonry Construction) - At plank / CMU joint\n• Option 1 - If gap is greater than 1/4\", Transition Membrane must be used to seal the gap with minimum 3\" overlap\n• Option 2 - If gap is less than 1/4\", Liquid Membrane can be used to seal the gap\n• Option 3 - When shelf angles are to be installed, through wall flashing must be draped from above to completely cover the joints at top and bottom edges of the plank and sealed to the shelf angle.  The Liquid Membrane shall be applied up to and continuing on the underside of the shelf angle to achieve continuity."]
[null,"Plank Edges - At plank / steel girder joint\n• Through wall flashing must be draped from above to completely cover this joint and the entire face of the girder and sealed to the shelf angle.\n• This can be sealed with a transition membrane from the interior underside of the plank if the girder is solid and is allowed by local code."]
[null,"Steel Columns - Steel / CMU / Exterior Sheathing Joints\n• If allowed by local code, EPA suggests gaps shall be filled with backer rod as necessary and minimum 20 year sealant that is compatible with all surfaces applied to. Alternatively a transition membrane can be installed over top spanning the entire steel column, extending 3\" beyond each edge of the column and adhered to the substrate per manufacturer's recommendations."]
[null,"Wall to Roof Connections\n• Liquid air barrier must be brought up over grout edge part of roof plank and shall be sealed over the plank / grout joint"]
[null,"Transition between foundations and walls\n• Through wall flashing must be draped from above to completely cover this joint and adhered to the face of the foundation wall.\n• This can be sealed with a transition membrane from the interior underside of the plank if the girder is solid and is allowed by local code."]
[null,"Transition between one wall type and another\n• Gaps and joints primed and sealed with appropriate transition membrane or tape that is rated to withstand the thermal and structural deflection calculated for the joint in question\n• Edges of transition membrane or tape (termination seams) sealed with compatible sealant where not sealed by liquid membrane\n• All termination seams must be sealed with minimum 20-year compatible sealant."]
[null,"Transition at inside and outside corners\n• Gaps and joints primed and sealed with appropriate transition membrane or tape that is rated to withstand the thermal and structural deflection calculated for the joint in question\n• Edges of transition membrane or tape (termination seams) sealed with compatible sealant where not sealed by liquid membrane\n• All termination seams must be sealed with minimum 20-year compatible sealant."]
[" ","Transition between exterior enclosure and interior walls, floors and ceilings that bound non-conditioned spaces (e.g. garages, some mechanical rooms, vented attics, vented crawlspaces)\n• At these transitions the rain water control elements remain as part of the exterior enclosure while the insulation, air barrier and condensation control functions connect to the interior walls, floors and ceilings."]
[null,"Other\n• Use this worksheet to identify areas to be inspected based on building geometry, construction, location of mechanicals and building utilities, etc.  The list is not exhaustive and the responsible party must still review building plans and field conditions to identify additional leakage sources to be sealed."]
[]
[]
[]
[]
[null,null,null,null,null,null,null,null,null,null,null,null,null,"Yes"]
[null,null,null,null,null,null,null,null,null,null,null,null,null,"No"]
[null,null,null,null,null,null,null,null,null,null,null,null,null,"N/A"]

{"sheet":"8.1-INF_COMPTZN VIS INSPECTION","index":23,"n_rows":55,"n_cols":14,"rows_kept":55,"cut":false,"hidden":false,"merged":[[52,0,52,4],[53,1,53,4],[48,1,48,7],[50,1,50,7],[64,1,64,4],[62,1,62,4],[54,1,54,4],[55,1,55,4],[61,1,61,4],[59,1,59,4],[60,1,60,4],[68,1,68,4],[67,1,67,4],[66,1,66,4],[56,1,56,4],[57,1,57,4],[58,1,58,4],[63,1,63,4],[65,1,65,4],[4,7,4,8],[5,7,5,8],[6,7,6,8],[25,1,25,6],[7,1,7,6],[10,1,10,6],[11,1,11,6],[7,7,7,8],[12,1,12,6],[8,1,8,6],[9,1,9,6],[13,1,13,6],[23,1,23,6],[21,1,21,6],[24,1,24,6],[22,1,22,6],[26,1,26,6],[31,1,31,7],[32,1,32,7],[36,1,36,7],[33,1,33,7],[28,1,28,4],[30,1,30,4],[38,1,38,7],[34,1,34,7],[35,1,35,7],[44,1,44,7],[51,1,51,7],[37,1,37,7],[46,1,46,7],[47,1,47,7],[49,1,49,7],[40,1,40,7],[41,1,41,7],[42,1,42,7],[43,1,43,7],[45,1,45,7],[39,1,39,7]]}
[null,null,"ENERGY STAR"]
[null,null,"MULTIFAMILY HIGH RISE PROGRAM"]
[null,null,"Project Name: ",{"$f":"'Project Info'!C3","v":0}]
[]
[null,"INFILTRATION - COMPARTMENTALIZATION - PROTOCOL 8.1",null,null,null,null,null,"Date:",null,"Field Verified By:"]
[]
[null,"Schedule:"]
[null,"This process begins with the construction documentation.  A minimum of 3-5 site visits are recommended to properly inspect air sealing details. Each exterior, common area and in-unit element on the air sealing checklists must be inspected at each of the following stages to ensure use of proper materials and complete seals exist for each juncture or penetration:\n"]
[null,"1) Window/Wall Mock Up Inspection (If applicable)"]
[null,"2) Load-bearing wall and slab-edge/rim-joist inspection:  air/vapor/weather barrier prior to enclosure"]
[null,"3) Pre-drywall visual inspection of penetrations"]
[null,"4) Sample apartment inspection and blower door test "]
[null,"5) Post-correction testing of sample apartment"]
[null,"6) Final inspection and testing of apartments post completion\n"]
[null,"\n"]
[null,"Equipment Needed"]
[null,"1) Camera"]
[null,"2) Measuring Tape or ruler"]
[null,"3) Floor Plans and Relevant Details"]
[]
[null,"Sampling Requirements:"]
[null,"1)  For elements that provide central services to the building (i.e. entry doors, central duct chases, utility service penetrations, etc.) a minimum 50% sample shall be inspected.  For elements that are repeated throughout the building or occur in every living unit (i.e. windows, wall/floor connections, air conditioner sleeves, etc.) follow RESNET sampling protocol.  If problems are identified, additional units must be inspected to determine if the problems are systemic so an appropriate repair order can be issued."]
[null,"2) One sample apartment will be inspected and tested to ensure air sealing details are correct before building-wide installations continue."]
[null,"3) During construction, apartment units must be visually inspected prior to drywall and upon final completion following RESNET sampling protocol.  The sample set shall be representative of the variety of apartment types in the building, including:  end/corner units and inside units; top-floor, middle-floor, bottom-floor units; and at least one unit of each size/type (i.e., studios, 1-bed, 2-bed, etc.)."]
[null,"4) *PHOTOS REQUIRED*"]
[null,"Provide one representative photograph of continuous air barrier at all types of typical joints, junctions, and general coverage areas. Include the following at a minimum:"]
[null,"5a)  Inspected from the interior: Window to interior gypsum board, Air conditioner sleeve sealed to drywall (cover is installed if ACs provided by building), Outlet/Electrical Box - Exterior and Demising Walls, Heating pipe penetrations through exterior walls, Heating pipe penetrations through interior partitions, Plumbing / Sprinkler Pipe Penetrations, Range Gas Line Penetration, Gypsum board to concrete ceiling plank connection - Exterior walls and all interior partition walls, Gap between take off duct and gypsum board, Electrical Panel, HVAC Access Doors, Thermostats, Intercoms, Lighting Fixtures, Door Latch Hole, Medicine Cabinet\n"]
[null,"NOTES FOR DRAWINGS AND SPECIFICATIONS",null,null,null,"PLAN REVIEW COMMENTS","LOCATION\ndwg / spec","PLAN REVIEW"]
[null,"• Walls, ceilings and floors that separate each apartment from neighboring apartments, corridors, common space, trash chutes, utility chases and trenches, upper floor, lower floors, stairwells and elevator shafts must be air sealed to form a continuous air barrier surrounding the apartment and connecting to the exterior enclosure air barrier system.\n• As with the exterior air barrier, the compartmentalization air barrier bid and contract documents shall demonstrate a continuous, unbroken air barrier separating each apartment from surrounding spaces.  Air barrier materials and accessories shall be clearly identified in section, plan and details."]
[null,"PROTOCOL",null,null,null,"PLAN REVIEW COMMENTS","LOCATION\ndwg / spec","PLAN REVIEW","INSPECTION","INSPECTION COMMENTS \n(Use this field to note problems, specific inspection details, or changes in As-Built compared to Design, like model numbers. If installed as designed, please state “Same as Design”. If make/model numbers have changed, list them here.)\n"]
[null,"Compliance Statement\n• Assembly is consistent with the project specifications and Proposed Design model or meets or exceeds the requirements listed in the Prescriptive Path."]
[null,"Sample Unit - Visual Inspection\n• The developer shall set up at least two sample units with both exterior enclosure and apartment compartmentalization air sealing details completed for initial inspection.  The units shall include a corner unit and a middle unit.  All air sealing details must be open for inspection – visible from the interior or exterior of the building.  The sample unit inspection will be used to identify problems with the exterior enclosure air sealing approach and apartment compartmentalization before building-wide construction and air sealing of apartments is completed.  The inspection may be spread over more than a single visit to accommodate schedules but all air sealing details should be inspected.  The sample units should also be used for Preliminary Fan Pressure Testing if applicable."]
[null,"Inspect framing layout for interior demising (common) walls and interior partitions to ensure:\n• Demising wall air barrier (e.g.  sealed gypsum board or coated CMU) extends completely to all adjacent walls and is connected in an air tight way to the exterior enclosure air barriers.\n• Demising wall air barrier (e.g.  sealed gypsum board or coated CMU)  extends completely to ceiling plank (or other solid ceiling material) where drop ceilings are present. \n\n"]
[null,"Gypsum board to concrete ceiling plank connection\n• Exterior walls and all interior partition walls"]
[null,"Gypsum board to concrete floor plank connection \n• Exterior walls and all interior partition walls"]
[null,"A/C Sleeve Cover (if A/Cs provided by building)\n• Verify that insulated covers for through-wall AC units have been provided by the building for use during heating season and when AC units are not installed.  Ensure the cover is equipped with a gasket so when installed it will have an airtight seal against the drywall. As an alternative to a gasket, sealant may be used but will have to be resealed each time it is installed."]
[null,"Window to interior gypsum board"]
[null,"Air conditioner sleeve sealed to drywall"]
[null,"Outlet/Electrical Box - Exterior and Demising Walls"]
[null,"Heating pipe penetrations through exterior walls"]
[null,"Heating pipe penetrations through interior partitions"]
[null,"Plumbing / Sprinkler Pipe Penetrations"]
[null,"Range Gas Line Penetration"]
[null,"Gap between take off duct and gypsum board"]
[null,"Electrical Panel"]
[null,"HVAC Access Doors"]
[null,"Thermostats"]
[null,"Intercoms"]
[null,"Lighting Fixtures"]
[null,"Door Latch Hole"]
[null,"Medicine Cabinet"]
[null,"Other\n• Use this worksheet to identify areas to be inspected based on building geometry, construction, location of mechanicals and building utilities, etc.  The list is not exhaustive and the responsible party must still review building plans and field conditions to identify additional leakage sources to be sealed."]
[null,null,null,null,null,null,null,null,null,null,null,null,null,"Yes"]
[null,null,null,null,null,null,null,null,null,null,null,null,null,"No"]
[null,null,null,null,null,null,null,null,null,null,null,null,null,"N/A"]

{"sheet":"8.1 - INF_BLOWER DOOR TEST","index":24,"n_rows":55,"n_cols":16,"rows_kept":55,"cut":false,"hidden":false,"merged":[[46,12,46,13],[47,12,47,13],[48,12,48,13],[39,12,39,13],[40,12,40,13],[41,12,41,13],[42,12,42,13],[43,12,43,13],[44,12,44,13],[4,11,4,13],[5,11,5,13],[6,11,6,13],[45,12,45,13],[33,11,33,13],[34,11,34,13],[35,11,35,13],[7,11,7,13],[32,11,32,13],[31,11,31,13],[6,9,6,10],[4,9,4,10],[5,9,5,10],[8,1,8,8],[27,1,27,10],[8,9,8,10],[9,1,9,8],[10,1,10,8],[11,1,11,8],[7,9,7,10],[29,1,29,6],[8,11,8,12],[35,1,35,9],[34,1,34,9],[33,1,33,9],[32,2,32,6],[31,2,31,6]]}
[null,null,"ENERGY STAR"]
[null,null,"MULTIFAMILY HIGH RISE PROGRAM"]
[null,null,{"$f":"'Project Info'!B3","v":"Project Name: "},null,{"$f":"'Project Info'!C3","v":0}]
[]
[null,"INFILTRATION - BLOWER DOOR TEST - PROTOCOL 8.1",null,null,null,null,null,null,null,"Date:",null,"Field Verified By:"]
[]
[]
[null,"Schedule:"]
[null,"This process begins with the construction documentation.  A minimum of 3-5 site visits are recommended to properly inspect air sealing details. Each exterior, common area and in-unit element on the air sealing checklists must be inspected at each of the following stages to ensure use of proper materials and complete seals exist for each juncture or penetration.  Fan pressure testing shall be conducted for two purposes: Preliminary testing should be conducted on an initial set of apartments to verify the performance of the air barrier detailing and installation and Final verification testing shall be conducted on a subset of the remaining apartments for quality assurance."]
[null,"1) Sample apartment inspection and blower door test "]
[null,"2) Post-correction testing of sample apartment"]
[null,"3) Final inspection and testing of apartments post completion\n"]
[]
[null,"Equipment Needed"]
[null,"1) Camera"]
[null,"2) Measuring Tape or ruler"]
[null,"3) Knife"]
[null,"4) Screwdrivers (Hex, Phillips, Flat)"]
[null,"5) Duct Mask"]
[null,"6) Blue Painter's Tape"]
[null,"7) Metal Tape"]
[null,"8) Floor Plans"]
[null,"9) Riser Diagrams"]
[null,"10) Duct Blaster"]
[null,"11) Manometer"]
[]
[null,"Sampling Requirements:"]
[null,"1) Post-construction, single point blower door testing of apartment units must be conducted following RESNET sampling protocol. The tested units shall be representative of the variety of apartment types in the building, including: end/corner units and inside units; top-floor, middle-floor, bottom-floor units; and at least one unit of each size/type (i.e., studios, 1-bed, 2-bed, etc.).  Any apartment that exceeds the allowed leakage rate (0.30 CFM50 per square foot of enclosure), must confirm that all items below have been properly sealed prior to retesting. Per RESNET Section 603.7.8, until the failure is corrected in all identified (failed) apartments in the sample set, none of the apartments shall be deemed to meet the threshold or labeling criteria."]
[null,"NOTES FOR DRAWINGS AND SPECIFICATIONS",null,null,null,null,null,"PLAN REVIEW COMMENTS","LOCATION\ndwg / spec","PLAN REVIEW"]
[null,"• Enclosed apartments must be fan pressure tested as an independent unit in accordance with either ASTM E779 2010 or ASTM E1827.  The target maximum air leakage rate is 0.3 CFM per square foot of the enclosure bounding the apartment at an induced pressure difference of 50 pascals.  E{A recommends at least two sample apartments are fan pressure tested as soon as they can be scheduled.  A subset of the remaining apartments shall be fan pressure tested for quality assurance purposes. See the section on Fan Pressure Testing for details."]
[]
[null,"PROTOCOL","PATH REQUIREMENT",null,null,null,null,"PLAN REVIEW COMMENTS","LOCATION\ndwg / spec","PLAN REVIEW","INSPECTION","INSPECTION COMMENTS \n(Use this field to note problems, specific inspection details, or changes in As-Built compared to Design, like model numbers. If installed as designed, please state “Same as Design”. If make/model numbers have changed, list them here.)"]
[null,"Compliance Statement\n• Assembly is consistent with the project specifications and Proposed Design model or meets or exceeds the requirements listed in the Prescriptive Path.",{"$f":"IF('Project Info'!C4='Project Info'!P35,'Prescriptive Path Checklist'!C118&\"\n\nSpecific apartment air leakage paths to be sealed are listed in the ENERGY STAR Multifamily High Rise T&V Worksheet 8.1-INF_COMPTZN VIS INSPECTION\",IF('Project Info'!C4='Project Info'!P36,'Prerequisites Checklist'!C113&\"\n\nSpecific apartment air leakage paths to be sealed are listed in the ENERGY STAR Multifamily High Rise T&V Worksheet 8.1-INF_COMPTZN VIS INSPECTION\",\"<Select compliance path on the 'Project Info' tab>\"))","v":"<Select compliance path on the 'Project Info' tab>"}]
[null,"Preliminary Testing (Recommended)\n• The initial set of tested apartments should include at least one corner unit and one middle unit.\n• The preliminary testing should be conducted at the earliest time in the construction process possible before building-wide air sealing of apartments is completed.\n• Before an apartment can be tested, the air barrier systems for both the exterior enclosure and the interior compartmentalization should be installed and inspected.\n• The apartments selected for preliminary testing shall be tested using the methods described below.  If the units meet or beat the air leakage target of 0.30 CFM per square foot of enclosure at 50 pascals, the inspections described above continue to ensure air barrier integrity of the exterior enclosure and apartment compartmentalization continues at the same quality.\n• If an apartment fails to meet or beat the target air leakage rate, then deficiencies in the air barriers should be identified and corrected until all apartments in the preliminary test set have passed.  Use the results of these tests to develop a punch list of details to be modified as construction continues.  The inspection checklist should be modified to incorporate the lessons learned from the preliminary tests and the modified inspections should proceed to ensure air barrier integrity of the exterior enclosure and for apartment compartmentalization continues at the newly identified quality.\n• Send a summary of the preliminary tests, results and any recommendations to the project team to reduce apartment infiltration moving forward. \n\n\n"]
[null,"Final Verification Testing\n• When seven apartments are ready for final testing, each apartment must be tested and pass in order to begin sampling. Once sampling begins, one apartment shall be selected at random from a group of seven apartments.  More than one group of seven may be available for testing at the same time, but they must be divided into identified groups of seven or less.  The logic for responding to units that pass or fail then follows the RESNET 2006 Mortgage Industry National Home Energy Rating Systems Standard sampling protocol.\n• If the randomly selected test apartment passes, then all apartments in that set are deemed to pass.\n• If the randomly selected test unit fails, then an additional 2 units in that group of seven must be tested.  If either of those two units fail, then the remaining 4 units must be tested.  Any unit that fails must have the air barrier deficiencies corrected until it meets or beats the air leakage target of 0.30 CFM at 50 pascals induced pressure difference.  See the Sampling Requirements section of this protocol for more details.\n• Continue this process until all apartments have been included in a group of seven."]
[null,"Fan Pressure Testing Method \n• Prior to testing follow Residential Energy Services Network (RESNET) Mortgage Industry’s National Home Energy Rating Systems Section 802.2 Protocol for Preparing the Building Enclosure for Testing.\n• Measure the air leakage rate of a test apartment using fan pressurization techniques following either ASTM E779 2010 or ASTM E1827.  If using ASTM E1827, a one-point test at 50 Pascal using the average CFM50 measured under depressurization is acceptable for this measurement.  \n• When performing this test, the calibrated blower door fan shall be located in the entry door, balcony/patio door or window of the apartment.  Windows in adjacent apartments shall be open during the test.  Alternatively, the pressure difference between the test unit and the neighboring units can be measured when the test unit is depressurized 50 pascals relative to outdoor air.  Windows do not need to be opened in a neighboring unit if the pressure difference between it and the test unit is greater than or equal to 45 pascals.   If the apartment entry door opens to a corridor or other enclosed space, that space shall be well open to the outside during the test (e.g., opening the windows and corridor doors in neighboring units achieves both ends).  \n• Conduct any QA procedures on test equipment and set-up recommended by the blower door manufacturer (e.g., ensure that the fan flow is in the proper direction for flow measurement to be accurate).  Check the tubing connections to the flow sensing element and that the flow sensing element is properly positioned.\n• Conduct test to see whether or not the apartment air leakage rate is less than or equal to 0.30 CFM50 per square foot of enclosure (e.g., all surfaces enclosing the apartment, including exterior and party walls, floors, ceiling).  Use the guidance in the Preliminary or Final Verification Testing sections above to determine the next action (e.g., test more apartments, make repairs or write report). \n• Note:  This test does not distinguish between leakage from the apartment to outside and leakage from the apartment to other interior and/or interstitial spaces.  The allowable limit for measured leakage is for the total enclosure of the apartment unit.\n"]
[]
[null,"Apartment Tightness Summary: This section can be duplicated, copy and insert rows"]
[]
[null,"Apt #","Floor #","Unit Type \n(e.g. A, B, C)","# of Bedrooms","Floor Area\n(FA)","Perimeter Wall Length\n(PWL) ","Ceiling Height\n(CH)","Enclosure Area \n(2* FA) + (PWL*CH)","Maximum CFM50 allowed","Tested CFM50","Tested CFM50/SF \n(Criteria is <=.30)","Comments"]
[null,null,null,null,null,null,null,null,{"$f":"(2*F41)+(G41*H41)","v":0},{"$f":"0.3*I41","v":0},null,{"$f":"K41/I41","v":{"$error":"#DIV/0!"}}]
[null,null,null,null,null,null,null,null,0,{"$f":"0.3*I42","v":0},null,{"$error":"#DIV/0!"}]
[null,null,null,null,null,null,null,null,0,0,null,{"$error":"#DIV/0!"}]
[null,null,null,null,null,null,null,null,0,0,null,{"$error":"#DIV/0!"}]
[null,null,null,null,null,null,null,null,0,0,null,{"$error":"#DIV/0!"}]
[null,null,null,null,null,null,null,null,0,0,null,{"$error":"#DIV/0!"}]
[null,null,null,null,null,null,null,null,0,0,null,{"$error":"#DIV/0!"}]
[null,null,null,null,null,null,null,null,0,0,null,{"$error":"#DIV/0!"}]
[null,null,null,null,null,null,null,null,0,0,null,{"$error":"#DIV/0!"}]
[]
[]
[]
[null,null,null,null,null,null,null,null,null,null,null,null,null,null,null,"Yes"]
[null,null,null,null,null,null,null,null,null,null,null,null,null,null,null,"No"]
[null,null,null,null,null,null,null,null,null,null,null,null,null,null,null,"N/A"]

{"sheet":"8.2 - VENT_SCHEDULE&TAB REPORT","index":25,"n_rows":171,"n_cols":24,"rows_kept":171,"cut":false,"hidden":false,"merged":[[35,17,35,19],[30,17,30,18],[36,17,36,19],[38,17,38,19],[39,17,39,19],[40,17,40,19],[41,17,41,19],[31,7,31,13],[37,17,37,19],[33,7,33,13],[55,17,55,19],[52,17,52,19],[42,17,42,19],[50,1,50,19],[48,1,48,19],[52,1,52,3],[47,7,47,13],[43,17,43,19],[53,17,53,19],[51,17,51,19],[53,1,53,3],[53,7,53,13],[55,7,55,13],[49,17,49,19],[54,7,54,13],[54,17,54,19],[54,1,55,3],[44,17,44,19],[47,17,47,19],[74,8,74,10],[61,7,61,13],[64,1,64,6],[62,1,62,6],[62,17,62,19],[61,1,61,6],[65,7,65,13],[67,1,67,6],[67,7,67,13],[70,1,70,15],[66,17,66,19],[65,17,65,19],[70,17,70,19],[69,17,69,19],[68,17,68,19],[60,17,60,19],[57,7,57,13],[56,17,56,19],[61,17,61,19],[60,7,60,13],[60,1,60,6],[59,7,59,13],[57,1,57,3],[59,1,59,3],[57,17,57,19],[83,5,83,7],[71,1,71,15],[75,14,75,16],[34,1,34,6],[34,7,34,13],[66,7,66,13],[65,1,65,6],[71,17,71,19],[62,7,62,13],[56,1,56,3],[56,7,56,13],[67,17,67,19],[69,1,69,15],[68,1,68,6],[75,17,75,19],[83,17,83,19],[74,17,74,19],[64,17,64,19],[63,1,63,19],[51,1,51,3],[49,1,49,6],[49,7,49,13],[58,1,58,19],[59,17,59,19],[4,16,4,17],[5,16,5,17],[6,16,6,17],[7,16,7,17],[5,18,5,19],[6,18,6,19],[7,18,7,19],[7,1,7,13],[8,1,8,13],[29,1,29,13],[28,1,28,13],[26,1,26,13],[9,1,9,13],[27,1,27,12],[33,1,33,6],[8,17,8,18],[9,17,9,18],[32,1,32,6],[32,7,32,13],[25,1,25,13],[141,2,141,12],[88,13,88,15],[51,7,51,13],[89,13,89,15],[90,13,90,15],[91,13,91,15],[92,13,92,15],[86,10,86,11],[52,7,52,13],[75,2,75,4],[74,2,74,4],[74,5,74,7],[75,5,75,7],[83,14,83,16],[64,7,64,13],[66,1,66,6],[75,8,75,10],[83,8,83,10],[74,11,74,13],[75,11,75,13],[74,14,74,16],[83,11,83,13],[83,2,83,4],[68,7,68,13]]}
[null,null,"ENERGY STAR"]
[null,null,"MULTIFAMILY HIGH RISE PROGRAM"]
[null,null,"Project Name: ",{"$f":"'Project Info'!C3","v":0}]
[]
[null,"VENTILATION - SCHEDULE AND OPERATION - PROTOCOL 8.2",null,null,null,null,null,null,null,null,null,null,null,null,null,null,"Date:",null,"Field Verified By:"]
[]
[null,"Schedule:"]
[null,"1) The developer or GC shall ensure that deliveries are inspected prior to accepting them to verify that product substitutions by the distributor or manufacturer have not resulted in non-ENERGY STAR certified exhaust fans for in-unit ventilation systems."]
[null,"2) Minimum of one on-site inspection required, preferably immediately after installation so that corrective action can be taken if necessary.  Delivery tickets may be used to verify complete shipments but on-site inspections of a sample of installed appliances is required."]
[null,"3) Flow measurements cannot be verified until interior drywall and registers are installed. "]
[]
[null,"Equipment Needed:"]
[null,"1) Camera"]
[null,"2) Measuring Tape or ruler"]
[null,"3) Screwdrivers (Hex, Phillips, Flat)"]
[null,"4) Floor Plans (preferably with mechanicals)"]
[null,"5) Roof Plans (preferably with mechanicals)"]
[null,"6) Mechanical Schedule"]
[null,"7) Cut Sheets from Contractor Submittals"]
[null,"8) Pressure Pan"]
[null,"9) Manometer"]
[null,"10) Quantified CO release (if applicable)"]
[]
[]
[null,"Sampling Requirements:"]
[null,"1) 100% of ventilation equipment serving common spaces must be inspected and verified for system performance (ie. fan efficiency, controls).  Ventilation performance (CFM) at the delivery location (register) can be sampled at every other floor. The overall sample shall include at least one riser for each type/size of fan installed in the building serving common space."]
[null,"2) 100% of central ventilation equipment serving apartments must be inspected and verified for system performance (ie. fan efficiency, controls).   Ventilation performance (CFM) at the delivery location (register) can be sampled following the modified RESNET sampling protocol outlined in the How to Use this Manual section on page 11 of the T&V Protocols.  The overall sample shall include at least one riser for each type/size of fan installed in the building serving apartments. For each ventilation riser tested, take measurements at every other floor to obtain a representative profile.  "]
[null,"3) Verification of in-unit ventilation equipment performance (ie. fan efficiency, controls) and in-unit ventilation performance (CFM) at the delivery location (register) can be sampled following the modified RESNET sampling protocol outlined in the How to Use this Manual section of the T&V Protocols. "]
[null,"4) *PHOTOS REQUIRED*"]
[null,"- Photo of fan installation and nameplates\n- For through-wall kitchen exhaust ventilation, photo of kitchen exhaust venting to outside\n- If applicable, photograph location of CO/NO2 sensors and air intake point."]
[]
[null,"NOTES FOR DRAWINGS AND SPECIFICATIONS",null,null,null,null,null,"PLAN REVIEW COMMENTS",null,null,null,null,null,null,"LOCATION\ndwg / spec","PLAN REVIEW"]
[null,"Construction documents must include performance criteria for central and in-unit ventilation systems including: \n• Apartment in-line and ceiling exhaust fans must be ENERGY STAR certified."]
[null,"Construction documents must also include the following criteria apply to projects using the Prescriptive Path:\n• Central exhaust and in-line exhaust systems serving apartments must have self-balancing dampers at each grill.\n• Central exhaust fans 1/16 HP and less must be direct-drive and have variable speed controllers.\n• Central exhaust fans greater than 1/16 HP and less than 1 HP must be direct-drive with ECM motors and variable speed controllers.\n• Central exhaust fans 1 HP and larger must have NEMA Premium efficient motors.\n• In addition to requirements above, powered common laundry ventilation must be installed with automatic demand control to turn off ventilation fans when no dryers are operating."]
[null,"Construction documents must include performance criteria for buildings with garages including: \n• If following the Prescriptive Path, when garage exhaust is required by code, CO/NO2 sensors must be installed that control exhaust fan operation.\n• Include threshold criteria for CO/NO2 concentration which activates sensors.\n• Include a schedule of CO/NO2 controls with make, model, location and count.\n• Include locations, powering of sensors, and connecting wiring on plans.\n• Include fan size (CFM capacity) in ventilation schedule and air intake points on plans to properly ventilate throughout garage area.\n"]
[null,"ID","DESCRIPTION","LOCATION","QUANTITY","MFR","MODEL #","DESIGN CFM","DESIGN PRESSURE (Pa)","FAN\nPOWER (HP, BHP, kW, Watts)","ENERGY STAR / NEMA PREMIUM?","ECM?","DIRECT-DRIVE?","VARIABLE SPEED CONTROLLERS?","LOCATION\ndwg / spec","PLAN REVIEW","INSPECTION","INSPECTION COMMENTS \n(Use this field to note problems, specific inspection details, or changes in As-Built compared to Design, like model numbers. If installed as designed, please state “Same as Design”. If make/model numbers have changed, list them here.)"]
[]
[]
[]
[]
[]
[]
[]
[]
[]
[]
[]
[null,"PROTOCOL",null,null,"PATH REQUIREMENT","PROPOSED\nERM","ENERGY \nMODEL","PLAN REVIEW COMMENTS",null,null,null,null,null,null,"LOCATION\ndwg / spec","PLAN REVIEW","INSPECTION","INSPECTION COMMENTS \n(Use this field to note problems, specific inspection details, or changes in As-Built compared to Design, like model numbers. If installed as designed, please state “Same as Design”. If make/model numbers have changed, list them here.)"]
[null,"COMPLIANCE STATEMENT"]
[null,"Compliance Statement\n• All ventilation systems are consistent with the project specifications and Proposed Design model or meets or exceeds the requirements listed in the Prescriptive Path."]
[null,"MODELING INPUTS - SIZING & BALANCING"]
[null,"Non - Apartment Fan Efficiency\n• Design specifications shall include fan energy efficiency criteria (BHP and motor efficiency) for the fans themselves.",null,null,{"$f":"IF('Project Info'!C4='Project Info'!P35,'Prescriptive Path Checklist'!C120,IF('Project Info'!C4='Project Info'!P36,\"NA\",\"<Select compliance path on the 'Project Info' tab>\"))","v":"<Select compliance path on the 'Project Info' tab>"},{"$f":"ERMs!C62","v":0},{"$f":"ERMs!D62","v":0}]
[null,"Apartment Fan Efficiency (Roof)\n• Specifications shall include fan energy efficiency criteria (BHP and motor efficiency) for the fans themselves.",null,null,{"$f":"IF('Project Info'!C4='Project Info'!P35,'Prescriptive Path Checklist'!C124,IF('Project Info'!C4='Project Info'!P36,\"NA\",\"<Select compliance path on the 'Project Info' tab>\"))","v":"<Select compliance path on the 'Project Info' tab>"},{"$f":"ERMs!C60","v":0},{"$f":"ERMs!D60","v":0}]
[null,"Apartment Fan Efficiency (In-Unit)\n• Specifications shall also include fan energy efficiency criteria (Watts/CFM) for the fans themselves. ",null,null,{"$f":"IF('Project Info'!C4='Project Info'!P35,'Prescriptive Path Checklist'!C125,IF('Project Info'!C4='Project Info'!P36,'Prerequisites Checklist'!C116,\"<Select compliance path on the 'Project Info' tab>\"))","v":"<Select compliance path on the 'Project Info' tab>"},{"$f":"ERMs!C61","v":0},{"$f":"ERMs!D61","v":0}]
[null,"All Ventilation Systems - Capacity, Testing and Balancing\n• The developer may choose to hire a Test and Balance (TAB) contractor to commission the system or any part thereof.  Either the TAB contractor or the responsible party shall provide a balancing report for each shaft with operating pressures at the grill furthest from the fan and with airflow (CFM) measurements at apartment and common area grills following RESNET sampling protocol described below. Airflow shall be measured with equipment that fully enclose grills and is able to measure as low as 20 CFM ± 5 CFM. Air intake point shall also be inspected.\n• For kitchen exhaust fans, prescriptive duct sizing requirements described at www.energystar.gov/newhomesresources may be used in lieu of measuring the actual air flow rate.\n• Average supply and exhaust CFM measurement shall be updated in the As-Built model where applicable. \n• If following the Prescriptive Path, common area ventilation systems cannot exceed ASHRAE 62.1-2007 by more than 50%.  Apartment ventilation systems cannot exceed ASHRAE 62.2-2007 by more than 50%.",null,null,{"$f":"IF('Project Info'!C4='Project Info'!P35,'Prescriptive Path Checklist'!C119,IF('Project Info'!C4='Project Info'!P36,'Prerequisites Checklist'!C114,\"<Select compliance path on the 'Project Info' tab>\"))","v":"<Select compliance path on the 'Project Info' tab>"},{"$f":"ERMs!C56","v":0},{"$f":"ERMs!D56","v":0}]
[null,null,null,null,{"$f":"IF('Project Info'!C4='Project Info'!P35,'Prescriptive Path Checklist'!C122,IF('Project Info'!C4='Project Info'!P36,'Prerequisites Checklist'!C115,\"<Select compliance path on the 'Project Info' tab>\"))","v":"<Select compliance path on the 'Project Info' tab>"},{"$f":"ERMs!C57","v":0},{"$f":"ERMs!D57","v":0}]
[null,"Demand Controls\n• Verify control systems including timing devices, demand control sensors, or other devices match project specifications and Proposed Design model or meets or exceeds the requirements listed in the Prescriptive Path.\n\nEPA suggests including the following in the design where applicable:\n• Controls to allow for intermittent (ON/OFF) operation of central exhaust fans are not permitted.\n• Public/Office Bathroom Exhaust Configuration and Control:\n    • If vented to the roof with a central fan:  Motorized damper controlled by light switch to open when occupied (normally tightly closed).\n    • If vented thru-wall:  ENERGY STAR certified fan vented through-wall controlled by light switch to activate when occupied.",null,null,{"$f":"IF('Project Info'!C4='Project Info'!P35,'Prescriptive Path Checklist'!C121,IF('Project Info'!C4='Project Info'!P36,\"NA\",\"<Select compliance path on the 'Project Info' tab>\"))","v":"<Select compliance path on the 'Project Info' tab>"},{"$f":"ERMs!C63","v":0},{"$f":"ERMs!D63","v":0}]
[null,"Heat or Energy Recovery\n• Consider heat or energy recovery for 100% of corridor supply air. Capacity of heat recovery unit should match the design corridor ventilation rates.",null,null,"NA",{"$f":"ERMs!C58","v":0},{"$f":"ERMs!D58","v":0}]
[null,"GARAGE VENTILATION"]
[null,"Garage Exhaust Fan CFM and Efficiency\n• Equipment is consistent with the project specifications and Proposed Design model or meets or exceeds the requirements listed in the Prescriptive Path.\n• Provide Testing and balancing (TAB) report showing fan’s performance and balance at intake points. TAB to be provided by the installing contractor, responsible party or commissioning agent.",null,null,"NA",{"$f":"ERMs!C64","v":0},{"$f":"ERMs!D64","v":0}]
[null,"Test Sensor Operation\n• If following the Prescriptive Path, when garage exhaust is required by code, CO/NO2 sensors must be installed that control exhaust fan operation.\n• Using quantified CO tracer gas release (obtain specifications from chemical test suppliers), confirm performance of sensor and activation of fans.\n• A Statement of Substantial Completion or approved proxy may be submitted to establish completion of the work associated with this protocol. A Statement of Substantial Completion is to be completed by the installation contractor or other qualified representative on company letter head and attached to all relevant T&V Worksheets complete with all required information, photographs, cut sheets, etc.\n"]
[null,"CO/NO2 Sensor Locations\n• Record sensor locations and confirm conformance with plans."]
[null,"Garage Fan and CO/NO2 Sensor - Manufacturer's Product Data\n• Include cut sheet showing fan and sensor specifications such as CFM and CO/NO2 concentration threshold."]
[null,"VENTILATION MISC"]
[null,"Toilet, Kitchen, General Exhaust Grills and Corridor Supply Ventilation Grills\n• EPA recommends that each exhaust and supply grill assembly be equipped with a self-balancing damper that responds to changes in duct pressure to allow a constant airflow (+/- 20%) over a range of operating pressures from 0.2 in WC to the greater of:  0.5 in WC or the maximum system operating pressure at the particular exhaust register/grill. This is critical to helping ensure the system performs according to project specifications and Proposed Design model.\n• If following the Prescriptive Path Central exhaust and in-line exhaust systems serving apartments must have self-balancing dampers at each grill.\n• Adjustable register assemblies that allow for the free area to be manually adjusted in the field should not be used to meet this requirement. Self balancing dampers shall be designed and installed in any situation where more than one exhaust point is connected to a fan so that they may be easily removed for cleaning or replacement.\n• For inspection:  Self balancing dampers have been installed in correct position and are functioning properly. For through-wall kitchen exhaust systems, photo-document the exhaust outlet at the exterior to confirm that they are vented to the outside."]
[null,"Common Area Supply Ventilation - Outdoor Air Damper\n• For systems designed with outdoor-air supplied to the ventilation distribution system, provide motorized dampers that will automatically shut when systems or spaces are not in use.  Continuously running ventilation would not be subject to either damper, as they are always in use."]
[null,"Fresh Air Intake Systems - Operating Sequence\n• For both active and passive intake systems, design specifications must indicate operation sequence as it relates to controls, sensors, fans, dampers, etc.  "]
[null,"Fresh Air Intakes are Properly Located\n• For all make-up air systems, a visual inspection of the supply air source shall be conducted to ensure pollutants are not being drawn into the building unintentionally."]
[null,"Smoke Vents\n• If allowed by local code, stairwell bulkhead and elevator hoist way smoke vents must be normally closed and interlocked with motorized damper and smoke detector/fire alarm system per ASHRAE 90.1-2007, Section 6.4.3.4."]
[null,"Passive Intake Systems (Trickle Vents)\n• In passive intake systems (i.e., trickle vents), EPA recommends, but does not require, that airflow measurements be taken to verify flow rates are within design specifications under the range of conditions anticipated for system operation.  If airflow cannot be directly measured, pressure measurements can be used to estimate airflow based on manufacturer’s data for different pressure levels. "]
[null,"Ventilation - Manufacturer's Product Data\n• Review manufacturer’s cut sheets or invoice detailing system manufacturer, model, HP and CFM."]
[null,"Ventilation - Training and Manuals\n• EPA recommends confirming that all applicable operating and specification manuals are delivered to the building staff. EPA also recommends verifying that staff members have been trained and are aware of their responsibilities to maintain and operate the systems properly. Summarize any training performed and personnel involved."]
[]
[null,"All ventilation fans installed and listed above should be listed here to document tested ventilation rates. Insert rows to meet sampling protocol. "]
[null,"Fan/Shaft ID",{"$f":"B37","v":0},null,null,{"$f":"B38","v":0},null,null,{"$f":"B39","v":0},null,null,{"$f":"B40","v":0},null,null,{"$f":"B41","v":0},null,null,{"$f":"B42","v":0}]
[null,"Total Design CFM"]
[null,"Floor","Apt # or Space","Design CFM","Tested CFM","Apt # or Space","Design CFM","Tested CFM","Apt # or Space","Design CFM","Tested CFM","Apt # or Space","Design CFM","Tested CFM","Apt # or Space","Design CFM","Tested CFM","Apt # or Space","Design CFM","Tested CFM"]
[]
[]
[]
[]
[]
[]
[null,"Bottom Floor Pressure (Pa), if applicable"]
[]
[null,"Calculator for Non Apartment Spaces (ASHRAE 62.1 - 2007)"]
[null,null,null,null,null,null,null,null,null,null,"Ventilation Requirements (CFM)"]
[null,"Space Name","Number of Floors","Space Type","CFM/Person","CFM/SF","Occupant Density/1000 SF","Occupants per room (optional) ","Floor Area (SF)","Ventilation Design (CFM)","based on space type","based on occ. density","% above or below vent. req't",null,"Comments"]
[null,null,null,null,{"$f":"VLOOKUP(D89,$B$153:$G$164,2,FALSE)","v":{"$error":"#N/A"}},{"$f":"VLOOKUP(D89,$B$153:$G$164,3,FALSE)","v":{"$error":"#N/A"}},{"$f":"VLOOKUP(D89,$B$153:$G$164,4,FALSE)","v":{"$error":"#N/A"}},null,null,null,{"$f":"((I89*F89)+(G89*(I89/1000)*E89))*C89","v":{"$error":"#N/A"}},{"$f":"H89*(VLOOKUP(D89,$B$153:$G$164,5,FALSE))","v":{"$error":"#N/A"}},{"$f":"IF(L89=0,(J89-(MAX(K89:L89)))/(MAX(K89:L89)),IF(ABS(J89-L89)>ABS(J89-K89),(J89-K89)/K89,(J89-L89)/L89))","v":{"$error":"#N/A"}}]
[null,null,null,null,{"$f":"VLOOKUP(D90,$B$153:$G$164,2,FALSE)","v":{"$error":"#N/A"}},{"$f":"VLOOKUP(D90,$B$153:$G$164,3,FALSE)","v":{"$error":"#N/A"}},{"$f":"VLOOKUP(D90,$B$153:$G$164,4,FALSE)","v":{"$error":"#N/A"}},null,null,null,{"$f":"((I90*F90)+(G90*(I90/1000)*E90))*C90","v":{"$error":"#N/A"}},{"$f":"H90*(VLOOKUP(D90,$B$153:$G$164,5,FALSE))","v":{"$error":"#N/A"}},{"$f":"IF(L90=0,(J90-(MAX(K90:L90)))/(MAX(K90:L90)),IF(ABS(J90-L90)>ABS(J90-K90),(J90-K90)/K90,(J90-L90)/L90))","v":{"$error":"#N/A"}}]
[null,null,null,null,{"$f":"VLOOKUP(D91,$B$153:$G$164,2,FALSE)","v":{"$error":"#N/A"}},{"$f":"VLOOKUP(D91,$B$153:$G$164,3,FALSE)","v":{"$error":"#N/A"}},{"$f":"VLOOKUP(D91,$B$153:$G$164,4,FALSE)","v":{"$error":"#N/A"}},null,null,null,{"$f":"((I91*F91)+(G91*(I91/1000)*E91))*C91","v":{"$error":"#N/A"}},{"$f":"H91*(VLOOKUP(D91,$B$153:$G$164,5,FALSE))","v":{"$error":"#N/A"}},{"$f":"IF(L91=0,(J91-(MAX(K91:L91)))/(MAX(K91:L91)),IF(ABS(J91-L91)>ABS(J91-K91),(J91-K91)/K91,(J91-L91)/L91))","v":{"$error":"#N/A"}}]
[null,null,null,null,{"$f":"VLOOKUP(D92,$B$153:$G$164,2,FALSE)","v":{"$error":"#N/A"}},{"$f":"VLOOKUP(D92,$B$153:$G$164,3,FALSE)","v":{"$error":"#N/A"}},{"$f":"VLOOKUP(D92,$B$153:$G$164,4,FALSE)","v":{"$error":"#N/A"}},null,null,null,{"$f":"((I92*F92)+(G92*(I92/1000)*E92))*C92","v":{"$error":"#N/A"}},{"$f":"H92*(VLOOKUP(D92,$B$153:$G$164,5,FALSE))","v":{"$error":"#N/A"}},{"$f":"IF(L92=0,(J92-(MAX(K92:L92)))/(MAX(K92:L92)),IF(ABS(J92-L92)>ABS(J92-K92),(J92-K92)/K92,(J92-L92)/L92))","v":{"$error":"#N/A"}}]
[null,null,null,null,{"$f":"VLOOKUP(D93,$B$153:$G$164,2,FALSE)","v":{"$error":"#N/A"}},{"$f":"VLOOKUP(D93,$B$153:$G$164,3,FALSE)","v":{"$error":"#N/A"}},{"$f":"VLOOKUP(D93,$B$153:$G$164,4,FALSE)","v":{"$error":"#N/A"}},null,null,null,{"$f":"((I93*F93)+(G93*(I93/1000)*E93))*C93","v":{"$error":"#N/A"}},{"$f":"H93*(VLOOKUP(D93,$B$153:$G$164,5,FALSE))","v":{"$error":"#N/A"}},{"$f":"IF(L93=0,(J93-(MAX(K93:L93)))/(MAX(K93:L93)),IF(ABS(J93-L93)>ABS(J93-K93),(J93-K93)/K93,(J93-L93)/L93))","v":{"$error":"#N/A"}}]
[null,null,null,null,null,null,null,null,"Total",{"$f":"SUM(J89:J93)","v":0},{"$f":"SUM(K89:K93)","v":{"$error":"#N/A"}},{"$f":"SUM(L89:L93)","v":{"$error":"#N/A"}}]
[]
[]
[null,"Calculator for Apartment Spaces (ASHRAE 62.2 - 2007)"]
[]
[null,"Whole Unit Ventilation "]
[]
[null,"Number of Bedrooms\n(studios are to be entered with (1) bedroom)","Typical Floor Area (SF)","Ventilation Design (CFM)","Calculated Ventilation Requirement (CFM)","Table 4.1a Ventilation Requirement (CFM)","% above min baseline (Must be at least 0%)","% above max baseline (Prescriptive Path projects cannot Exceed 50%)"]
[null,null,null,null,{"$f":"IF(OR(B102=\"\",C102=\"\",D102=\"\"),\"-\",IF(C102=\"\",0,((0.01*C102)+(7.5*(IF(B102=0,1,B102)+1)))))","v":"-"},{"$f":"IF(OR(B102=\"\",C102=\"\",D102=\"\"),\"-\",IF(C102<=$B$144,HLOOKUP(B102,$C$143:$M$149,2,FALSE),IF(C102<=$B$145,HLOOKUP(B102,$C$143:$M$149,3,FALSE),IF(C102<=$B$146,HLOOKUP(B102,$C$143:$M$149,4,FALSE),IF(C102<=$B$147,HLOOKUP(B102,$C$143:$M$149,5,FALSE),IF(C102<=$B$148,HLOOKUP(B102,$C$143:$M$149,6,FALSE),HLOOKUP(B102,$C$143:$M$149,7,FALSE)))))))","v":"-"},{"$f":"(D102-E102)/E102","v":{"$error":"#VALUE!"}},{"$f":"(D102-F102)/F102","v":{"$error":"#VALUE!"}}]
[null,null,null,null,"-","-",{"$error":"#VALUE!"},{"$error":"#VALUE!"}]
[null,null,null,null,"-","-",{"$error":"#VALUE!"},{"$error":"#VALUE!"}]
[null,null,null,null,"-","-",{"$error":"#VALUE!"},{"$error":"#VALUE!"}]
[null,null,null,null,"-","-",{"$error":"#VALUE!"},{"$error":"#VALUE!"}]
[null,null,null,null,"-","-",{"$error":"#VALUE!"},{"$error":"#VALUE!"}]
[null,null,null,null,"-","-",{"$error":"#VALUE!"},{"$error":"#VALUE!"}]
[null,null,null,null,"-","-",{"$error":"#VALUE!"},{"$error":"#VALUE!"}]
[null,null,null,null,"-","-",{"$error":"#VALUE!"},{"$error":"#VALUE!"}]
[null,null,"Total",{"$f":"SUM(D102:D110)","v":0},{"$f":"SUM(E102:E110)","v":0}]
[]
[]
[null,"Local Exhaust Ventilation - Continuous"]
[]
[null,"Kitchen Type","Volume (CF)","Ventilation Design (CFM)","Ventilation Requirement (CFM)","% above baseline (Must be at least 0% and Prescriptive Path projects cannot exceed 50%)"]
[null,null,null,null,{"$f":"5*C117/60","v":0},{"$f":"(D117-E117)/E117","v":{"$error":"#DIV/0!"}}]
[null,null,null,null,0,{"$error":"#DIV/0!"}]
[null,null,null,null,0,{"$error":"#DIV/0!"}]
[null,null,null,null,0,{"$error":"#DIV/0!"}]
[null,null,null,null,0,{"$error":"#DIV/0!"}]
[null,null,null,null,0,{"$error":"#DIV/0!"}]
[]
[]
[null,"Bathroom Type","Ventilation Design (CFM)","Total Ventilation Requirement (CFM)","% above baseline (Must be at least 0% and Prescriptive Path projects cannot exceed 50%)"]
[null,null,null,20,{"$f":"(C126-D126)/D126","v":-1}]
[null,null,null,20,{"$f":"(C127-D127)/D127","v":-1}]
[null,null,null,20,{"$f":"(C128-D128)/D128","v":-1}]
[null,null,null,20,{"$f":"(C129-D129)/D129","v":-1}]
[null,null,null,20,{"$f":"(C130-D130)/D130","v":-1}]
[]
[]
[null,"Local Exhaust Ventilation - Intermittent"]
[]
[]
[null,"Space Type","Ventilation Design (CFM)","Ventilation Requirement (CFM)","% above baseline (Must be at least 0% and Prescriptive Path projects cannot exceed 50%)"]
[null,null,null,{"$f":"VLOOKUP(B137,$B$170:$C$171,2,FALSE)","v":{"$error":"#N/A"}},{"$f":"(C137-D137)/D137","v":{"$error":"#N/A"}}]
[null,null,null,{"$f":"VLOOKUP(B138,$B$170:$C$171,2,FALSE)","v":{"$error":"#N/A"}},{"$f":"(C138-D138)/D138","v":{"$error":"#N/A"}}]
[]
[]
[null,"ASHRAE 62.2 - 2007 Table 4.1a - Ventilation Air Requirements, CFM"]
[null,null,"Bedrooms"]
[null,"Max Floor Area",0,1,2,3,4,5,6,7,8,9,10]
[null,1500,30,30,45,45,60,60,75,75,90,90,90]
[null,3000,45,45,60,60,75,75,90,90,105,105,105,null,null,null,null,null,null,null,null,null,null,"Yes"]
[null,4500,60,60,75,75,90,90,105,105,120,120,120,null,null,null,null,null,null,null,null,null,null,"No"]
[null,6000,75,75,90,90,105,105,120,120,135,135,135,null,null,null,null,null,null,null,null,null,null,"N/A"]
[null,7500,90,90,105,105,120,120,135,135,150,150,150]
[null,999999,105,105,120,120,135,135,150,150,165,165,165]
[]
[null,"ASHRAE 62.1 - 2007 Table 6-1"]
[null,"Space Type","CFM/Person","CFM/SF","Occupant Density","Combined Outdoor Air Rate","Air Class"]
[null,"Conference/\nMeeting Room",5,0.06,50,6,1]
[null,"Corridors",0,0.06,0,0,1]
[null,"Storage Rooms",0,0.12,0,0,1]
[null,"Laundry rooms, central",5,0.12,10,17,2]
[null,"Lobbies",7.5,0.06,30,10,1]
[null,"Multipurpose assembly",5,0.06,120,6,1]
[null,"Office space",5,0.06,5,17,1]
[null,"Reception areas",5,0.06,30,7,1]
[null,"Main entry lobbies (office only)",5,0.06,10,11,1]
[null,"Computer (not printing)",5,0.06,4,20,1]
[null,"Electrical Equipment Rooms",0,0.06,0,0,1]
[null,"Elevator Machine Rooms",0,0.12,0,0,1]
[]
[]
[]
[null,"ASHRAE 62.2 - 2007 Table 5.1 & 5.2"]
[null,"Ventilation Type","Intermittent","Units","Continuous","Units"]
[null,"Kitchen",100,"CFM",5,"ACH"]
[null,"Bath",50,"CFM",20,"CFM"]

{"sheet":"8.2 - VENT_DUCT TIGHTNESS","index":26,"n_rows":97,"n_cols":16,"rows_kept":97,"cut":false,"hidden":false,"merged":[[37,1,37,7],[38,1,38,7],[40,6,40,7],[40,8,40,9],[39,1,39,7],[31,3,32,3],[31,4,32,4],[35,1,35,7],[36,1,36,7],[33,1,33,7],[31,1,32,1],[34,1,34,7],[4,7,4,8],[5,7,5,8],[6,7,6,8],[29,1,29,4],[27,1,27,5],[26,1,26,5],[7,7,7,8],[8,1,8,6],[25,1,25,5],[59,2,59,3],[57,2,57,3],[58,2,58,3],[43,8,43,9],[44,8,44,9],[45,8,45,9],[46,8,46,9],[47,8,47,9],[48,8,48,9],[49,8,49,9],[50,8,50,9],[51,8,51,9],[52,8,52,9]]}
[null,null,"ENERGY STAR"]
[null,null,"MULTIFAMILY HIGH RISE PROGRAM"]
[null,null,"Project Name: ",{"$f":"'Project Info'!C3","v":0}]
[]
[null,"VENTILATION - DUCT TIGHTNESS TEST - PROTOCOL 8.2",null,null,null,null,null,"Date:",null,"Field Verified By:"]
[]
[]
[null,"Schedule:"]
[null,"1)  Inspect and test duct systems for leakage upon installation including all take offs and branches and prior to enclosure with drywall.  The intent is to test the duct system before drywall and grills are installed so corrections can be made if duct leakage is excessive, however all take offs branch duct work, bottom caps and permanent roof curbs must be installed prior to testing. Takeoffs are typically installed floor by floor. "]
[]
[]
[null,"Equipment Needed"]
[null,"1) Camera"]
[null,"2) Measuring Tape or ruler"]
[null,"3) Knife"]
[null,"4) Screwdrivers (Hex, Phillips, Flat)"]
[null,"5) Duct Mask"]
[null,"6) Foam Blocks (***If dry wall has started)"]
[null,"7) Metal Tape"]
[null,"8) Floor and Roof Plans (preferably with mechanicals)"]
[null,"9) Riser Diagrams"]
[null,"10) Duct Blaster"]
[null,"11) Manometer"]
[]
[null,"Sampling Requirements:"]
[null,"1)  Apartment ventilation risers must be inspected and verified for system performance following the modified RESNET sampling protocol outlined in the How to Use this Manual section on page 11 of the T&V Protocols.  For each ventilation riser in the sample set, conduct inspections at every other floor to obtain a representative profile.  The sample shall include at least one riser for each type/size of fan installed in the building."]
[null,"2) *PHOTOS REQUIRED*"]
[null,"- One representative photo of each duct sealing detail outlined below"]
[null,"NOTES FOR DRAWINGS AND SPECIFICATIONS",null,null,null,"PLAN REVIEW COMMENTS","LOCATION\ndwg / spec","PLAN REVIEW"]
[null,"Construction documents must include performance criteria for central and in-unit ventilation systems including: \n\nFor central ventilation systems:\n• Roof curb and or wall penetrations has been sealed  \n• Mastic or other UL-181 compliant material shall be applied within temperature range and according to all other manufacturer's requirements at ALL transverse joints and take offs.\n• All duct transitional junctions have been sealed with mastic or other UL-181 compliant material.\n• All connections between gypsum board and ductwork must be sealed.\n• Total exhaust shaft leakage shall not exceed the sum of 5 CFM50 per register per shaft plus 5 CFM50 floor per shaft at a pressure of 0.2 in WC (2.5 CFM50 if following the Prescriptive Path)\n• Contractor shall adjust roof fan to provide a pressure of 0.2 – 0.3 inches WC at the grill farthest from the fan.\n\nFor in-line fan exhaust systems:\n• Mastic or other UL-181 compliant material shall be applied within temperature range and according to all other manufacturer's requirements at ALL transverse joints and take offs. \n• All duct transitional junctions have been sealed with mastic or other UL-181 compliant material.  \n• All connections between gypsum board and ductwork must be sealed.\n• If plank core is to be used as duct, ceiling plank penetration has been sealed.\n• If plank core is to be used as duct, plank core has been effectively connected to exterior of the building. \n• The appropriate plank core was selected that aligns with exterior louver.\n"]
[null,"PROTOCOL","PATH REQUIREMENT","PROPOSED\nERM","ENERGY \nMODEL","PLAN REVIEW \nCOMMENTS","LOCATION\ndwg / spec","PLAN REVIEW","INSPECTION","INSPECTION COMMENTS \n(Use this field to note problems, specific inspection details, or changes in As-Built compared to Design, like model numbers. If installed as designed, please state “Same as Design”. If make/model numbers have changed, list them here.)\n"]
[null,"Compliance Statement\n• Assembly is consistent with the project specifications and Proposed Design.  Central exhaust systems serving apartments must be tested for duct leakage, which cannot exceed the sum of 5 CFM50 per register per shaft plus 5 CFM50 per floor per shaft. For projects using the Prescriptive Path, leakage cannot exceed the sum of 2.5 CFM50 per register per shaft plus 2.5 CFM50 per floor per shaft.",{"$f":"IF('Project Info'!C4='Project Info'!P35,'Prescriptive Path Checklist'!C126,IF('Project Info'!C4='Project Info'!P36,'Prerequisites Checklist'!C117,\"<Select compliance path on the 'Project Info' tab>\"))","v":"<Select compliance path on the 'Project Info' tab>"},{"$f":"ERMs!C59","v":0},{"$f":"ERMs!D59","v":0}]
[null,null,{"$f":"IF('Project Info'!C4='Project Info'!P35,'Prescriptive Path Checklist'!C127,IF('Project Info'!C4='Project Info'!P36,'Prerequisites Checklist'!C118,\"<Select compliance path on the 'Project Info' tab>\"))","v":"<Select compliance path on the 'Project Info' tab>"}]
[null,"Duct Leakage Testing (Central Exhaust Serving Apartments)\n• Following the procedures outlined in your duct leakage tester operation manual, a single or five-point test for total duct leakage in the main duct shaft using a calibrated fan between -50 and -100 Pascal measured under depressurization or 50 and 100 Pascal under pressurization is acceptable for this measurement.  \n• When conducting a duct leakage depressurization test, the flow conditioner and one of the flow rings must always be installed.\n• EPA does not require the duct tester to be connected to a specific location in the shaft, however typically central exhaust duct tightness tests are conducted from the roof with the duct tester connected to the roof curb.  Often a transition plate is needed to effectively seal the duct tester to the roof curb opening. Cardboard is usually a readily accessible material on construction sites and can be easily adapted into such a transition plate (precut plastic, acrylic glass and or rubber sheets could also be used).\n• The pressure probe should be installed approximately 5’ downstream of the connection between the duct and the duct tester, with the probe configured so it’s openings face perpendicular to the direction of flow and only static pressure is measured, not velocity pressure.  When connecting the duct tester to the roof curb, poke a hole in the transition sheet and run the tubing and pressure probe inside of the shaft before connecting the transition sheet. Often static pressure probes come with a magnet to help configure the probe in the right direction, but if the inside surface of the duct is not magnetic, a weighted pressure hose could be used with holes cut out of the sides to prevent velocity pressure from being measured.\n• For five-point tests, use the Linear Regression Assistant below to find the CFM50 leakage.  \n• If credit is being taken for improved energy efficiency of the ventilation duct system, adjust As-Built energy model based on actual duct leakage rates as described in the Simulation Guidelines. Provide a summary of results of any duct leakage or ventilation performance testing; a sample table is provided in the T&V Worksheets.\n"]
[null,"Roof Curb/Wall Penetration (Central)\n• Roof curb and or wall penetration sealing."]
[null,"Transverse Joints (Central and Through Wall)\n• All transverse joints sealed air-tight with mastic applied according to manufacturers requirements (i.e. application temperature). This includes verifying through visual inspection that joints and gaps between all exhaust and supply ducts and sheetrock at the grills have been sealed."]
[null,"Transitions (Central and Through Wall)\n• All duct transitional junctions have been sealed with mastic."]
[null,"Pinned Ducts  (Central and Through Wall)\n• All joints have been completely sealed around the entire perimeter including those tight against a wall or ceiling. Before connecting ductwork at this condition, ample mastic needs to be applied to both sections and then connected while the mastic is still wet to achieve the seal."]
[null,"Elbow Joints (Round Duct Work)\n• All elbow joints have been effectively sealed with mastic."]
[null,"Exterior Wall Connection  (Through Wall)\n• Ductwork connection with exterior grill termination has been sealed air-tight."]
[]
[null,"Duct Leakage Summary (Single-Point tests): This section can be expanded, copy and insert rows as needed."]
[]
[null,"Fan/Shaft ID","# Registers Served","# floors","Design Exhaust CFM","CFM50 Leakage from Single-Point Test","% Leakage of Design CFM","MAX CFM50","Comments"]
[null,null,null,null,null,null,{"$f":"F45/E45","v":{"$error":"#DIV/0!"}},{"$f":"IF('Project Info'!C4=\"Prescriptive\",2.5*C45+2.5*D45, IF('Project Info'!C4=\"Performance\",5*C45+5*D45,\"\"))","v":""}]
[null,null,null,null,null,null,{"$f":"F46/E46","v":{"$error":"#DIV/0!"}},{"$f":"IF('Project Info'!C4=\"Prescriptive\",2.5*C46+2.5*D46, IF('Project Info'!C4=\"Performance\",5*C46+5*D46,\"\"))","v":""}]
[null,null,null,null,null,null,{"$error":"#DIV/0!"},{"$f":"IF('Project Info'!C4=\"Prescriptive\",2.5*C47+2.5*D47, IF('Project Info'!C4=\"Performance\",5*C47+5*D47,\"\"))","v":""}]
[null,null,null,null,null,null,{"$error":"#DIV/0!"},{"$f":"IF('Project Info'!C4=\"Prescriptive\",2.5*C48+2.5*D48, IF('Project Info'!C4=\"Performance\",5*C48+5*D48,\"\"))","v":""}]
[null,null,null,null,null,null,{"$error":"#DIV/0!"},{"$f":"IF('Project Info'!C4=\"Prescriptive\",2.5*C49+2.5*D49, IF('Project Info'!C4=\"Performance\",5*C49+5*D49,\"\"))","v":""}]
[null,null,null,null,null,null,{"$error":"#DIV/0!"},{"$f":"IF('Project Info'!C4=\"Prescriptive\",2.5*C50+2.5*D50, IF('Project Info'!C4=\"Performance\",5*C50+5*D50,\"\"))","v":""}]
[null,null,null,null,null,null,{"$error":"#DIV/0!"},{"$f":"IF('Project Info'!C4=\"Prescriptive\",2.5*C51+2.5*D51, IF('Project Info'!C4=\"Performance\",5*C51+5*D51,\"\"))","v":""}]
[null,null,null,null,null,null,{"$error":"#DIV/0!"},{"$f":"IF('Project Info'!C4=\"Prescriptive\",2.5*C52+2.5*D52, IF('Project Info'!C4=\"Performance\",5*C52+5*D52,\"\"))","v":""}]
[null,null,null,null,null,null,{"$error":"#DIV/0!"},{"$f":"IF('Project Info'!C4=\"Prescriptive\",2.5*C53+2.5*D53, IF('Project Info'!C4=\"Performance\",5*C53+5*D53,\"\"))","v":""}]
[]
[]
[null,"Linear Regression Assistant: This section can be used for multi-point testing and can be duplicated by copying/inserting rows."]
[]
[null,"Fan/Shaft ID","Approximate Indoor Temp (F):"]
[null,null,"Approximate Outdoor Temp (F):"]
[null,null,"Baseline Pressure (Pa):"]
[]
[null,null,"Shaft Pressure","Fan Pressure (Pa)","Plate Position","Flow Rate (cfm)","Temp Corc Flow (cfm)","Log (Duct Curb Press)","Log (Flowrate)"]
[null,null,null,null,null,{"$f":"IF(E63=1,ABS(D63-$E$60)^0.5*41.42,IF(E63=2,ABS(D63-$E$60)^0.5*15.8,IF(E63=3,ABS(D63-$E$60)^0.5*6.33,IF(E63=\"O\",ABS(D63-$E$60)^0.5*108.5,\"Enter Plate Position\"))))","v":"Enter Plate Position"},{"$f":"F63*SQRT(($E$59+460)/($E$58+460))","v":{"$error":"#VALUE!"}},{"$f":"LOG(ABS(C63-$E$60))","v":{"$error":"#NUM!"}},{"$f":"LOG(G63)","v":{"$error":"#VALUE!"}}]
[null,null,null,null,null,{"$f":"IF(E64=1,ABS(D64-$E$60)^0.5*41.42,IF(E64=2,ABS(D64-$E$60)^0.5*15.8,IF(E64=3,ABS(D64-$E$60)^0.5*6.33,IF(E64=\"O\",ABS(D64-$E$60)^0.5*108.5,\"Enter Plate Position\"))))","v":"Enter Plate Position"},{"$f":"F64*SQRT(($E$59+460)/($E$58+460))","v":{"$error":"#VALUE!"}},{"$f":"LOG(ABS(C64-$E$60))","v":{"$error":"#NUM!"}},{"$f":"LOG(G64)","v":{"$error":"#VALUE!"}}]
[null,null,null,null,null,{"$f":"IF(E65=1,ABS(D65-$E$60)^0.5*41.42,IF(E65=2,ABS(D65-$E$60)^0.5*15.8,IF(E65=3,ABS(D65-$E$60)^0.5*6.33,IF(E65=\"O\",ABS(D65-$E$60)^0.5*108.5,\"Enter Plate Position\"))))","v":"Enter Plate Position"},{"$f":"F65*SQRT(($E$59+460)/($E$58+460))","v":{"$error":"#VALUE!"}},{"$f":"LOG(ABS(C65-$E$60))","v":{"$error":"#NUM!"}},{"$f":"LOG(G65)","v":{"$error":"#VALUE!"}}]
[null,null,null,null,null,{"$f":"IF(E66=1,ABS(D66-$E$60)^0.5*41.42,IF(E66=2,ABS(D66-$E$60)^0.5*15.8,IF(E66=3,ABS(D66-$E$60)^0.5*6.33,IF(E66=\"O\",ABS(D66-$E$60)^0.5*108.5,\"Enter Plate Position\"))))","v":"Enter Plate Position"},{"$f":"F66*SQRT(($E$59+460)/($E$58+460))","v":{"$error":"#VALUE!"}},{"$f":"LOG(ABS(C66-$E$60))","v":{"$error":"#NUM!"}},{"$f":"LOG(G66)","v":{"$error":"#VALUE!"}}]
[null,null,null,null,null,{"$f":"IF(E67=1,ABS(D67-$E$60)^0.5*41.42,IF(E67=2,ABS(D67-$E$60)^0.5*15.8,IF(E67=3,ABS(D67-$E$60)^0.5*6.33,IF(E67=\"O\",ABS(D67-$E$60)^0.5*108.5,\"Enter Plate Position\"))))","v":"Enter Plate Position"},{"$f":"F67*SQRT(($E$59+460)/($E$58+460))","v":{"$error":"#VALUE!"}},{"$f":"LOG(ABS(C67-$E$60))","v":{"$error":"#NUM!"}},{"$f":"LOG(G67)","v":{"$error":"#VALUE!"}}]
[]
[]
[]
[]
[null,null,"Slope:",{"$f":"INDEX(LINEST(I63:I67,H63:H67),1)","v":{"$error":"#VALUE!"}}]
[null,null,"Intercept:",{"$f":"INDEX(LINEST(I63:I67,H63:H67),2)","v":{"$error":"#VALUE!"}}]
[]
[null,null,"C:",{"$f":"10^D73","v":{"$error":"#VALUE!"}}]
[null,null,"n:",{"$f":"D72","v":{"$error":"#VALUE!"}}]
[null,null,"R:",{"$f":"INDEX(LINEST(I63:I67,H63:H67,TRUE,TRUE),3)","v":{"$error":"#VALUE!"}}]
[]
[null,null,"From Regression:"]
[null,null,"CFM50:",{"$f":"D75*50^D76","v":{"$error":"#VALUE!"}}]
[]
[]
[]
[]
[]
[]
[]
[]
[]
[]
[]
[]
[]
[]
[null,null,null,null,null,null,null,null,null,null,null,null,null,"Yes",null,"Pressurization"]
[null,null,null,null,null,null,null,null,null,null,null,null,null,"No",null,"Depressurization"]
[null,null,null,null,null,null,null,null,null,null,null,null,null,"N/A"]

{"sheet":"9.1 - METERS","index":27,"n_rows":39,"n_cols":18,"rows_kept":39,"cut":false,"hidden":false,"merged":[[31,1,31,10],[32,1,32,10],[29,1,29,10],[30,1,30,10],[27,1,27,7],[28,1,28,7],[17,1,17,9],[19,1,19,9],[4,10,4,12],[5,10,5,12],[6,10,6,12],[7,10,7,12],[30,12,30,13],[31,12,31,13],[32,12,32,13],[26,12,26,13],[27,12,27,13],[28,12,28,13],[29,12,29,13]]}
[null,null,"ENERGY STAR"]
[null,null,"MULTIFAMILY HIGH RISE PROGRAM"]
[null,null,"Project Name: ",{"$f":"'Project Info'!C3","v":0}]
[]
[null,"METERS - CONFIGURATION - PROTOCOL 9.1",null,null,null,null,null,null,null,null,"Date:",null,null,"Field Verified By:"]
[]
[]
[]
[null,"Schedule:"]
[null,"1) After piping and wiring are complete"]
[null,"2) After installation, hook-up, and activation of meters."]
[]
[null,"Equipment Needed"]
[null,"1) Camera"]
[null,"2) Plans and Specifications"]
[]
[null,"Sampling Requirements:"]
[null,"1) Where metering is in basement or central location, check all meter banks.  Where metering is distributed in common areas, such as hallway utility closets or is inside individual apartments, follow the modified RESNET sampling protocol outlined in the How to Use this Manual section on page 11 of the T&V Protocols to include, at a minimum, one apartment from each line.\n"]
[null,"2) *PHOTOS REQUIRED*"]
[null,"- Provide photographs of all types of meters (electrical, gas, water) for building.  Be sure to properly label location and type of meter represented."]
[null,"METER TYPE:","Electric","Gas","Fuel Oil","Water","Steam","Hot Water","PLAN REVIEW COMMENTS","LOCATION\ndwg / spec","PLAN REVIEW"]
[null,"Location"]
[null,"Utility Company\n(National Grid)"]
[null,"Configuration\n(Direct, Master, Sub)"]
[null,"# of Meters"]
[null,"Areas Served\n(Common, Apts, Retail)"]
[null,"PROTOCOL",null,null,null,null,null,null,"PLAN REVIEW COMMENTS","LOCATION\ndwg / spec","PLAN REVIEW","INSPECTION","INSPECTION COMMENTS \n(Use this field to note problems, specific inspection details, or changes in As-Built compared to Design, like model numbers. If installed as designed, please state “Same as Design”. If make/model numbers have changed, list them here.)"]
[null,"Location - Residential\n• Confirm location and existence of electric, gas, and water meters and observe configurations (areas served) in relation to plans and specifications.   "]
[null,"Location - Nonresidential\n• Post-construction, the utility consumption of the residential-associated spaces must be capable of evaluation independent of any commercial/retail spaces. These nonresidential associated parts of the building shall be separately metered (or sub-metered) for electricity, gas, fuel oil, water, steam, and hot water for domestic and/or space heating purposes."]
[null,"Type\n• Check meter types against specifications (and/or utility correspondence). "]
[null,"Configuration\n• Confirm metering configuration: master meter, submetered, direct metered."]
[null,"Utility Release Forms\n• For buildings that are direct-metered for utilities to the apartments, the building owner must secure signed releases from individual apartment occupants to allow for benchmarking or find alternative methods to assessing whole building energy consumption, such as a whole-building meter or asking the utility for aggregated data. All data uploaded to Portfolio Manager is strictly confidential and only used to estimate the energy performance of the building as a whole, not of individual apartments. "]
[null,"Statement of Substantial Completion\n• A Statement of Substantial Completion or approved proxy may be used to establish completion of the work associated with this protocol. A Statement of Substantial Completion is to be completed by the installation contractor or other qualified representative on company letterhead, complete with all information, photographs, cut sheets, etc., required in this protocol and in the corresponding T&V Worksheet."]
[]
[]
[]
[null,null,null,null,null,null,null,null,null,null,null,null,null,null,null,null,null,"Yes"]
[null,null,null,null,null,null,null,null,null,null,null,null,null,null,null,null,null,"No"]
[null,null,null,null,null,null,null,null,null,null,null,null,null,null,null,null,null,"N/A"]

{"sheet":"Admin","index":28,"n_rows":196,"n_cols":15,"rows_kept":196,"cut":false,"hidden":true,"merged":[[191,1,191,9],[140,1,140,9],[146,1,146,9],[147,0,147,9],[152,0,152,9],[155,0,155,9],[165,0,165,9],[173,0,173,9],[176,0,176,9],[185,0,185,9],[92,1,92,9],[97,1,97,9],[161,1,161,9],[99,0,99,9],[103,0,103,9],[110,0,110,9],[120,0,120,9],[124,1,124,9],[136,0,136,9],[69,0,69,9],[74,0,74,9],[82,0,82,9],[88,0,88,9],[53,0,53,9],[56,1,56,9],[57,0,57,9],[62,0,62,9],[34,0,34,9],[37,0,37,9],[42,0,42,9],[48,0,48,9],[13,1,13,9],[20,1,20,9],[22,0,22,9],[32,0,32,9],[1,1,1,6],[2,1,2,6],[3,1,3,6],[5,15,9,18],[11,0,12,0],[11,1,12,1],[11,2,11,6],[11,7,11,9]]}
[null,"Instructions"]
[null,"1) This tab serves as an overview of a project's energy efficiency components including modeling assumptions, plan review and inspection comments."]
[null,"2) The columns on the right serve as a quick visual aid to see which components were not verified, red means not verified."]
[null,"3) Rows and columns can be hidden and adjusted to condense as much as possible before printing to send to members of the project team."]
[]
[null,"Project Name: ",{"$f":"'Project Info'!C3","v":0}]
[null,"Project Code: ",{"$f":"'Project Info'!C5","v":0}]
[null,"Address: ",{"$f":"'Project Info'!C6","v":0}]
[null,"City, State, Zip:",{"$f":"'Project Info'!C7","v":0}]
[null,"Climate Zone",{"$f":"'Project Info'!C8","v":0}]
[]
["Item #","BUILDING COMPONENT ","# REVIEW:  75% and 100% Design Completion Review\nPrepared by: \nDate: ",null,null,null,null,"AS BUILT REVIEW: \nPrepared by:\nDate: ",null,null,null,null,null,"Plan Review Administration Column","Inspection Administration Column"]
[null,null,"Proposed ERM \n(Method of Compliance \nby Client)","Values Used in Energy Model  ","Plan Review Comments ","Dwg/Spec","Verified","Inspection Comments ","Dwg/Spec","Verified",null,null,null,"Does this element comply?","Does this element comply?"]
[1,"APPLIANCES - ENERGY STAR"]
["1.1.1",{"$f":"'1.1 - APPLIANCES'!D26","v":"Refrigerators"},{"$f":"'1.1 - APPLIANCES'!E26","v":0},{"$f":"'1.1 - APPLIANCES'!F26","v":0},{"$f":"'1.1 - APPLIANCES'!L26","v":0},{"$f":"'1.1 - APPLIANCES'!M26","v":0},{"$f":"'1.1 - APPLIANCES'!N26","v":0},{"$f":"'1.1 - APPLIANCES'!P26","v":0},{"$f":"'1.1 - APPLIANCES'!M26","v":0},{"$f":"'1.1 - APPLIANCES'!O26","v":0},null,null,null,{"$f":"IF(OR(G15=\"No\",G15=0), \"No\", \"Yes\")","v":"No"},{"$f":"IF(OR(J15=\"No\",J15=0), \"No\", \"Yes\")","v":"No"}]
["1.1.2",{"$f":"'1.1 - APPLIANCES'!D27","v":"Dishwashers"},{"$f":"'1.1 - APPLIANCES'!E27","v":0},{"$f":"'1.1 - APPLIANCES'!F27","v":0},{"$f":"'1.1 - APPLIANCES'!L27","v":0},{"$f":"'1.1 - APPLIANCES'!M27","v":0},{"$f":"'1.1 - APPLIANCES'!N27","v":0},{"$f":"'1.1 - APPLIANCES'!P27","v":0},{"$f":"'1.1 - APPLIANCES'!M26","v":0},{"$f":"'1.1 - APPLIANCES'!O27","v":0},null,null,null,{"$f":"IF(OR(G16=\"No\",G16=0), \"No\", \"Yes\")","v":"No"},{"$f":"IF(OR(J16=\"No\",J16=0), \"No\", \"Yes\")","v":"No"}]
["1.1.3",{"$f":"'1.1 - APPLIANCES'!D28","v":"Clothes Washers"},{"$f":"'1.1 - APPLIANCES'!E28","v":0},{"$f":"'1.1 - APPLIANCES'!F28","v":0},{"$f":"'1.1 - APPLIANCES'!L28","v":0},{"$f":"'1.1 - APPLIANCES'!M28","v":0},{"$f":"'1.1 - APPLIANCES'!N28","v":0},{"$f":"'1.1 - APPLIANCES'!P28","v":0},{"$f":"'1.1 - APPLIANCES'!M26","v":0},{"$f":"'1.1 - APPLIANCES'!O28","v":0},null,null,null,"No","No"]
["1.1.4",{"$f":"'1.1 - APPLIANCES'!D29","v":"Ceiling fans"},{"$f":"'1.1 - APPLIANCES'!E29","v":0},{"$f":"'1.1 - APPLIANCES'!F29","v":0},{"$f":"'1.1 - APPLIANCES'!L29","v":0},{"$f":"'1.1 - APPLIANCES'!M29","v":0},{"$f":"'1.1 - APPLIANCES'!N29","v":0},{"$f":"'1.1 - APPLIANCES'!P29","v":0},{"$f":"'1.1 - APPLIANCES'!M27","v":0},{"$f":"'1.1 - APPLIANCES'!O29","v":0},null,null,null,{"$f":"IF(OR(G18=\"No\",G18=0), \"No\", \"Yes\")","v":"No"},{"$f":"IF(OR(J18=\"No\",J18=0), \"No\", \"Yes\")","v":"No"}]
["1.1.5",{"$f":"'1.1 - APPLIANCES'!D30","v":"Vending Machines"},{"$f":"'1.1 - APPLIANCES'!E30","v":0},{"$f":"'1.1 - APPLIANCES'!F30","v":0},{"$f":"'1.1 - APPLIANCES'!L30","v":0},{"$f":"'1.1 - APPLIANCES'!M30","v":0},{"$f":"'1.1 - APPLIANCES'!N30","v":0},{"$f":"'1.1 - APPLIANCES'!P30","v":0},{"$f":"'1.1 - APPLIANCES'!M29","v":0},{"$f":"'1.1 - APPLIANCES'!O30","v":0},null,null,null,{"$f":"IF(OR(G19=\"No\",G19=0), \"No\", \"Yes\")","v":"No"},{"$f":"IF(OR(J19=\"No\",J19=0), \"No\", \"Yes\")","v":"No"}]
["1.1.6","Statement of Substantial Completion","N/A","N/A","N/A","N/A","N/A",{"$f":"'1.1 - APPLIANCES'!P34","v":0},"N/A",{"$f":"'1.1 - APPLIANCES'!O34","v":0},null,null,null,"Yes","No"]
[2,"HEATING & DOMESTIC HOT WATER "]
["2.1.1","General",{"$f":"'5.1, 5.3 - HEATING'!F44","v":"See below"},{"$f":"'5.1, 5.3 - HEATING'!G44","v":"See below"},{"$f":"'5.1, 5.3 - HEATING'!H44","v":0},{"$f":"'5.1, 5.3 - HEATING'!M44","v":0},{"$f":"'5.1, 5.3 - HEATING'!N44","v":0},{"$f":"'5.1, 5.3 - HEATING'!P44","v":0},{"$f":"'5.1, 5.3 - HEATING'!M44","v":0},{"$f":"'5.1, 5.3 - HEATING'!O44","v":0},null,null,null,"No","No"]
["MODELING INPUTS"]
["2.2.1","Space Heating - Sizing",{"$f":"'5.1, 5.3 - HEATING'!F48","v":0},{"$f":"'5.1, 5.3 - HEATING'!G48","v":0},{"$f":"'5.1, 5.3 - HEATING'!H48","v":0},{"$f":"'5.1, 5.3 - HEATING'!M48","v":0},{"$f":"'5.1, 5.3 - HEATING'!N48","v":0},{"$f":"'5.1, 5.3 - HEATING'!P48","v":0},{"$f":"'5.1, 5.3 - HEATING'!M48","v":0},{"$f":"'5.1, 5.3 - HEATING'!O48","v":0},null,null,null,{"$f":"IF(OR(G24=\"No\",G24=0), \"No\", \"Yes\")","v":"No"},{"$f":"IF(OR(J24=\"No\",J24=0), \"No\", \"Yes\")","v":"No"}]
["2.2.2","Space Heating - Type & Efficiency",{"$f":"ERMs!C35","v":0},{"$f":"ERMs!D35","v":0},{"$f":"'5.1, 5.3 - HEATING'!H46","v":0},{"$f":"'5.1, 5.3 - HEATING'!M46","v":0},{"$f":"'5.1, 5.3 - HEATING'!N46","v":0},{"$f":"'5.1, 5.3 - HEATING'!P46","v":0},{"$f":"'5.1, 5.3 - HEATING'!M46","v":0},{"$f":"'5.1, 5.3 - HEATING'!O46","v":0},null,null,null,"No","No"]
["2.2.3","Heating Terminal Units - Electric Resistance or Freeze Protection",{"$f":"'5.1, 5.3 - HEATING'!F47","v":0},{"$f":"'5.1, 5.3 - HEATING'!G47","v":0},{"$f":"'5.1, 5.3 - HEATING'!H47","v":0},{"$f":"'5.1, 5.3 - HEATING'!M47","v":0},{"$f":"'5.1, 5.3 - HEATING'!N47","v":0},{"$f":"'5.1, 5.3 - HEATING'!P47","v":0},{"$f":"'5.1, 5.3 - HEATING'!M47","v":0},{"$f":"'5.1, 5.3 - HEATING'!O47","v":0},null,null,null,"No","No"]
["2.2.4","Space Heating Distribution - Fan Power",{"$f":"'5.1, 5.3 - HEATING'!F49","v":0},{"$f":"'5.1, 5.3 - HEATING'!G49","v":0},{"$f":"'5.1, 5.3 - HEATING'!H49","v":0},{"$f":"'5.1, 5.3 - HEATING'!M49","v":0},{"$f":"'5.1, 5.3 - HEATING'!N49","v":0},{"$f":"'5.1, 5.3 - HEATING'!P49","v":0},{"$f":"'5.1, 5.3 - HEATING'!M49","v":0},{"$f":"'5.1, 5.3 - HEATING'!O49","v":0},null,null,null,"No","No"]
["2.2.5","Space Heating - Design Temperatures",{"$f":"'5.1, 5.3 - HEATING'!F50","v":0},{"$f":"'5.1, 5.3 - HEATING'!G50","v":0},{"$f":"'5.1, 5.3 - HEATING'!H50","v":0},{"$f":"'5.1, 5.3 - HEATING'!M50","v":0},{"$f":"'5.1, 5.3 - HEATING'!N50","v":0},{"$f":"'5.1, 5.3 - HEATING'!P50","v":0},{"$f":"'5.1, 5.3 - HEATING'!M50","v":0},{"$f":"'5.1, 5.3 - HEATING'!O50","v":0},null,null,null,"No","No"]
["2.2.6","Space Heating - Controls",{"$f":"'5.1, 5.3 - HEATING'!F51","v":0},{"$f":"'5.1, 5.3 - HEATING'!G51","v":0},{"$f":"'5.1, 5.3 - HEATING'!H51","v":0},{"$f":"'5.1, 5.3 - HEATING'!M51","v":0},{"$f":"'5.1, 5.3 - HEATING'!N51","v":0},{"$f":"'5.1, 5.3 - HEATING'!P51","v":0},{"$f":"'5.1, 5.3 - HEATING'!M51","v":0},{"$f":"'5.1, 5.3 - HEATING'!O51","v":0},null,null,null,"No","No"]
["2.2.7","DHW - Type & Efficiency",{"$f":"'5.1, 5.3 - HEATING'!#REF!","v":{"$error":"#REF!"}},{"$f":"'5.1, 5.3 - HEATING'!#REF!","v":{"$error":"#REF!"}},{"$f":"'5.1, 5.3 - HEATING'!#REF!","v":{"$error":"#REF!"}},{"$f":"'5.1, 5.3 - HEATING'!#REF!","v":{"$error":"#REF!"}},{"$f":"'5.1, 5.3 - HEATING'!#REF!","v":{"$error":"#REF!"}},{"$f":"'5.1, 5.3 - HEATING'!#REF!","v":{"$error":"#REF!"}},{"$f":"'5.1, 5.3 - HEATING'!#REF!","v":{"$error":"#REF!"}},{"$f":"'5.1, 5.3 - HEATING'!#REF!","v":{"$error":"#REF!"}},null,null,null,{"$error":"#REF!"},{"$error":"#REF!"}]
["2.2.8","DHW - Storage Insulation",{"$f":"'5.1, 5.3 - HEATING'!#REF!","v":{"$error":"#REF!"}},{"$f":"'5.1, 5.3 - HEATING'!#REF!","v":{"$error":"#REF!"}},{"$f":"'5.1, 5.3 - HEATING'!#REF!","v":{"$error":"#REF!"}},{"$f":"'5.1, 5.3 - HEATING'!#REF!","v":{"$error":"#REF!"}},{"$f":"'5.1, 5.3 - HEATING'!#REF!","v":{"$error":"#REF!"}},{"$f":"'5.1, 5.3 - HEATING'!#REF!","v":{"$error":"#REF!"}},{"$f":"'5.1, 5.3 - HEATING'!#REF!","v":{"$error":"#REF!"}},{"$f":"'5.1, 5.3 - HEATING'!#REF!","v":{"$error":"#REF!"}},null,null,null,{"$error":"#REF!"},{"$error":"#REF!"}]
["2.2.9","DHW - Low Flow Fixtures",{"$f":"'5.1, 5.3 - HEATING'!#REF!","v":{"$error":"#REF!"}},{"$f":"'5.1, 5.3 - HEATING'!#REF!","v":{"$error":"#REF!"}},{"$f":"'5.1, 5.3 - HEATING'!#REF!","v":{"$error":"#REF!"}},{"$f":"'5.1, 5.3 - HEATING'!#REF!","v":{"$error":"#REF!"}},{"$f":"'5.1, 5.3 - HEATING'!#REF!","v":{"$error":"#REF!"}},{"$f":"'5.1, 5.3 - HEATING'!#REF!","v":{"$error":"#REF!"}},{"$f":"'5.1, 5.3 - HEATING'!#REF!","v":{"$error":"#REF!"}},{"$f":"'5.1, 5.3 - HEATING'!#REF!","v":{"$error":"#REF!"}},null,null,null,{"$error":"#REF!"},{"$error":"#REF!"}]
["HEATING & DHW"]
["2.3.2","Space Heating / DHW - Insulation for Piping","N/A","N/A",{"$f":"'5.1, 5.3 - HEATING'!H54","v":0},{"$f":"'5.1, 5.3 - HEATING'!M54","v":0},{"$f":"'5.1, 5.3 - HEATING'!N54","v":0},{"$f":"'5.1, 5.3 - HEATING'!P54","v":0},{"$f":"'5.1, 5.3 - HEATING'!M54","v":0},{"$f":"'5.1, 5.3 - HEATING'!O54","v":0},null,null,null,"No","No"]
["DHW"]
["2.4.1","DHW - Temperature","N/A","N/A",{"$f":"'5.1, 5.3 - HEATING'!#REF!","v":{"$error":"#REF!"}},{"$f":"'5.1, 5.3 - HEATING'!#REF!","v":{"$error":"#REF!"}},{"$f":"'5.1, 5.3 - HEATING'!#REF!","v":{"$error":"#REF!"}},{"$f":"'5.1, 5.3 - HEATING'!#REF!","v":{"$error":"#REF!"}},{"$f":"'5.1, 5.3 - HEATING'!#REF!","v":{"$error":"#REF!"}},{"$f":"'5.1, 5.3 - HEATING'!#REF!","v":{"$error":"#REF!"}},null,null,null,{"$error":"#REF!"},{"$error":"#REF!"}]
["2.4.2","DHW - Controls","N/A","N/A",{"$f":"'5.1, 5.3 - HEATING'!#REF!","v":{"$error":"#REF!"}},{"$f":"'5.1, 5.3 - HEATING'!#REF!","v":{"$error":"#REF!"}},{"$f":"'5.1, 5.3 - HEATING'!#REF!","v":{"$error":"#REF!"}},{"$f":"'5.1, 5.3 - HEATING'!#REF!","v":{"$error":"#REF!"}},{"$f":"'5.1, 5.3 - HEATING'!#REF!","v":{"$error":"#REF!"}},{"$f":"'5.1, 5.3 - HEATING'!#REF!","v":{"$error":"#REF!"}},null,null,null,{"$error":"#REF!"},{"$error":"#REF!"}]
["HYDRONIC DISTRIBUTION"]
["2.5.1","Heating Distribution - Piping Configuration","N/A","N/A",{"$f":"'5.1, 5.3 - HEATING'!H55","v":0},{"$f":"'5.1, 5.3 - HEATING'!M55","v":0},{"$f":"'5.1, 5.3 - HEATING'!N55","v":0},{"$f":"'5.1, 5.3 - HEATING'!P55","v":0},{"$f":"'5.1, 5.3 - HEATING'!M55","v":0},{"$f":"'5.1, 5.3 - HEATING'!O55","v":0},null,null,null,"No","No"]
["2.5.2","Heating Distribution - Pump Sizing","N/A","N/A",{"$f":"'5.1, 5.3 - HEATING'!H56","v":0},{"$f":"'5.1, 5.3 - HEATING'!M56","v":0},{"$f":"'5.1, 5.3 - HEATING'!N56","v":0},{"$f":"'5.1, 5.3 - HEATING'!P56","v":0},{"$f":"'5.1, 5.3 - HEATING'!M56","v":0},{"$f":"'5.1, 5.3 - HEATING'!O56","v":0},null,null,null,"No","No"]
["2.5.3","Heating Distribution - Pressure Control Set-points","N/A","N/A",{"$f":"'5.1, 5.3 - HEATING'!H57","v":0},{"$f":"'5.1, 5.3 - HEATING'!M57","v":0},{"$f":"'5.1, 5.3 - HEATING'!N57","v":0},{"$f":"'5.1, 5.3 - HEATING'!P57","v":0},{"$f":"'5.1, 5.3 - HEATING'!M57","v":0},{"$f":"'5.1, 5.3 - HEATING'!O57","v":0},null,null,null,{"$f":"IF(OR(G41=\"No\",G41=0), \"No\", \"Yes\")","v":"No"},{"$f":"IF(OR(J41=\"No\",J41=0), \"No\", \"Yes\")","v":"No"}]
["2.5.4","Heating Terminal Units - Thermostatic Controls","N/A","N/A",{"$f":"'5.1, 5.3 - HEATING'!H58","v":0},{"$f":"'5.1, 5.3 - HEATING'!M58","v":0},{"$f":"'5.1, 5.3 - HEATING'!N58","v":0},{"$f":"'5.1, 5.3 - HEATING'!P58","v":0},{"$f":"'5.1, 5.3 - HEATING'!M58","v":0},{"$f":"'5.1, 5.3 - HEATING'!O58","v":0},null,null,null,"No","No"]
["ALL FORCED AIR HEATING SYSTEMS (Including Heat Pumps)"]
["2.6.1","Heating Distribution - Outdoor Air Damper","N/A","N/A",{"$f":"'5.1, 5.3 - HEATING'!H60","v":0},{"$f":"'5.1, 5.3 - HEATING'!M60","v":0},{"$f":"'5.1, 5.3 - HEATING'!N60","v":0},{"$f":"'5.1, 5.3 - HEATING'!P60","v":0},{"$f":"'5.1, 5.3 - HEATING'!M60","v":0},{"$f":"'5.1, 5.3 - HEATING'!O60","v":0},null,null,null,"No","No"]
["2.6.2","Heating Distribution - Flex Duct Installation","N/A","N/A",{"$f":"'5.1, 5.3 - HEATING'!H61","v":0},{"$f":"'5.1, 5.3 - HEATING'!M61","v":0},{"$f":"'5.1, 5.3 - HEATING'!N61","v":0},{"$f":"'5.1, 5.3 - HEATING'!P61","v":0},{"$f":"'5.1, 5.3 - HEATING'!M61","v":0},{"$f":"'5.1, 5.3 - HEATING'!O61","v":0},null,null,null,"No","No"]
["2.6.3","Heating Distribution - Duct Insulation","N/A","N/A",{"$f":"'5.1, 5.3 - HEATING'!H62","v":0},{"$f":"'5.1, 5.3 - HEATING'!M62","v":0},{"$f":"'5.1, 5.3 - HEATING'!N62","v":0},{"$f":"'5.1, 5.3 - HEATING'!P62","v":0},{"$f":"'5.1, 5.3 - HEATING'!M62","v":0},{"$f":"'5.1, 5.3 - HEATING'!O62","v":0},null,null,null,"No","No"]
["2.6.4","Heating Distribution - Duct Sealing Details","N/A","N/A",{"$f":"'5.1, 5.3 - HEATING'!H63","v":0},{"$f":"'5.1, 5.3 - HEATING'!M63","v":0},{"$f":"'5.1, 5.3 - HEATING'!N63","v":0},{"$f":"'5.1, 5.3 - HEATING'!P63","v":0},{"$f":"'5.1, 5.3 - HEATING'!M63","v":0},{"$f":"'5.1, 5.3 - HEATING'!O63","v":0},null,null,null,"No","No"]
["2.6.6","Heating System - Refrigerant Charge, Airflow and Nameplate Data","N/A","N/A","N/A","N/A","N/A",{"$f":"'5.1, 5.3 - HEATING'!P65","v":0},"N/A",{"$f":"'5.1, 5.3 - HEATING'!O65","v":0},null,null,null,{"$f":"IF(OR(G48=\"No\",G48=0), \"No\", \"Yes\")","v":"Yes"},{"$f":"IF(OR(J48=\"No\",J48=0), \"No\", \"Yes\")","v":"No"}]
["IN-UNIT FORCED AIR HEATING SYSTEMS"]
["2.7.1","Heating Distribution - In-Unit Duct Sizing","N/A","N/A",{"$f":"'5.1, 5.3 - HEATING'!H67","v":0},{"$f":"'5.1, 5.3 - HEATING'!M67","v":0},{"$f":"'5.1, 5.3 - HEATING'!N67","v":0},{"$f":"'5.1, 5.3 - HEATING'!P67","v":0},{"$f":"'5.1, 5.3 - HEATING'!M67","v":0},{"$f":"'5.1, 5.3 - HEATING'!O67","v":0},null,null,null,"No","No"]
["2.7.2","Heating Distribution - In-Unit Pressure Balancing","N/A","N/A",{"$f":"'5.1, 5.3 - HEATING'!H68","v":0},{"$f":"'5.1, 5.3 - HEATING'!M68","v":0},{"$f":"'5.1, 5.3 - HEATING'!N68","v":0},{"$f":"'5.1, 5.3 - HEATING'!P68","v":0},{"$f":"'5.1, 5.3 - HEATING'!M68","v":0},{"$f":"'5.1, 5.3 - HEATING'!O68","v":0},null,null,null,{"$f":"IF(OR(G51=\"No\",G51=0), \"No\", \"Yes\")","v":"No"},{"$f":"IF(OR(J51=\"No\",J51=0), \"No\", \"Yes\")","v":"No"}]
["2.7.3","Heating Distribution - HVAC Contractor Checklist","N/A","N/A","N/A","N/A","N/A",{"$f":"'5.1, 5.3 - HEATING'!P70","v":0},"N/A",{"$f":"'5.1, 5.3 - HEATING'!O70","v":0},null,null,null,"Yes","No"]
["2.7.4","Heating Distribution - In-Unit Duct Leakage Testing","N/A","N/A","N/A","N/A","N/A",{"$f":"'5.1, 5.3 - HEATING'!P69","v":0},"N/A",{"$f":"'5.1, 5.3 - HEATING'!O69","v":0},null,null,null,"Yes","No"]
["HEATING SYSTEMS MISC"]
["2.8.1","Heating Distribution - Thermostat","N/A","N/A",{"$f":"'5.1, 5.3 - HEATING'!H72","v":0},{"$f":"'5.1, 5.3 - HEATING'!M72","v":0},{"$f":"'5.1, 5.3 - HEATING'!N72","v":0},{"$f":"'5.1, 5.3 - HEATING'!P72","v":0},{"$f":"'5.1, 5.3 - HEATING'!M72","v":0},{"$f":"'5.1, 5.3 - HEATING'!O72","v":0},null,null,null,"No","No"]
["2.8.4","Statement of Substantial Completion - HVAC","N/A","N/A","N/A","N/A","N/A",{"$f":"'5.1, 5.3 - HEATING'!#REF!","v":{"$error":"#REF!"}},"N/A",{"$f":"'5.1, 5.3 - HEATING'!#REF!","v":{"$error":"#REF!"}},null,null,null,"Yes",{"$error":"#REF!"}]
[3,"ENVELOPE "]
["BELOW GRADE WALLS"]
["3.1.1","Below Grade Walls - Notes for Drawings and Specifications","N/A","N/A",{"$f":"'3.1 - ENV_BELOW GRADE WALLS'!$F$27","v":0},{"$f":"'3.1 - ENV_BELOW GRADE WALLS'!$G$27","v":0},{"$f":"'3.1 - ENV_BELOW GRADE WALLS'!$H$27","v":0},"N/A","N/A","N/A",null,null,null,{"$f":"IF(OR(G59=\"No\",G59=0), \"No\", \"Yes\")","v":"No"},{"$f":"IF(OR(J59=\"No\",J59=0), \"No\", \"Yes\")","v":"Yes"}]
["3.1.2","Below Grade Walls - General",{"$f":"'3.1 - ENV_BELOW GRADE WALLS'!D49","v":0},{"$f":"'3.1 - ENV_BELOW GRADE WALLS'!E49","v":0},{"$f":"'3.1 - ENV_BELOW GRADE WALLS'!F49","v":0},{"$f":"'3.1 - ENV_BELOW GRADE WALLS'!G49","v":0},{"$f":"'3.1 - ENV_BELOW GRADE WALLS'!H49","v":0},{"$f":"'3.1 - ENV_BELOW GRADE WALLS'!J49","v":0},{"$f":"'3.1 - ENV_BELOW GRADE WALLS'!G49","v":0},{"$f":"'3.1 - ENV_BELOW GRADE WALLS'!I49","v":0},null,null,null,"No","No"]
["3.1.3","Below Grade Walls - Insulation and Initial Framing Inspection",{"$f":"'3.1 - ENV_BELOW GRADE WALLS'!D50","v":"<Select compliance path on the 'Project Info' tab>"},{"$f":"'3.1 - ENV_BELOW GRADE WALLS'!E50","v":0},{"$f":"'3.1 - ENV_BELOW GRADE WALLS'!F50","v":0},{"$f":"'3.1 - ENV_BELOW GRADE WALLS'!G50","v":0},{"$f":"'3.1 - ENV_BELOW GRADE WALLS'!H50","v":0},{"$f":"'3.1 - ENV_BELOW GRADE WALLS'!J50","v":0},{"$f":"'3.1 - ENV_BELOW GRADE WALLS'!G50","v":0},{"$f":"'3.1 - ENV_BELOW GRADE WALLS'!I50","v":0},null,null,null,"No","No"]
["3.1.4","Below Grade Walls - Wood-Framed Construction","N/A","N/A","N/A","N/A","N/A",{"$f":"'3.1 - ENV_BELOW GRADE WALLS'!J51","v":0},"N/A",{"$f":"'3.1 - ENV_BELOW GRADE WALLS'!I51","v":0},null,null,null,"Yes","No"]
["ABOVE GRADE WALLS"]
["3.2.1","Above Grade Walls - Notes for Drawings and Specifications","N/A","N/A",{"$f":"'3.1 - ENV_ABOVE GRADE WALLS'!$F$26","v":0},{"$f":"'3.1 - ENV_ABOVE GRADE WALLS'!$G$26","v":0},{"$f":"'3.1 - ENV_ABOVE GRADE WALLS'!$H$26","v":0},"N/A","N/A","N/A",null,null,null,{"$f":"IF(OR(G64=\"No\",G64=0), \"No\", \"Yes\")","v":"No"},{"$f":"IF(OR(J64=\"No\",J64=0), \"No\", \"Yes\")","v":"Yes"}]
["3.2.2","Above Grade Walls - General",{"$f":"'3.1 - ENV_ABOVE GRADE WALLS'!D65","v":0},{"$f":"'3.1 - ENV_ABOVE GRADE WALLS'!E65","v":0},{"$f":"'3.1 - ENV_ABOVE GRADE WALLS'!F65","v":0},{"$f":"'3.1 - ENV_ABOVE GRADE WALLS'!G65","v":0},{"$f":"'3.1 - ENV_ABOVE GRADE WALLS'!H65","v":0},{"$f":"'3.1 - ENV_ABOVE GRADE WALLS'!J65","v":0},{"$f":"'3.1 - ENV_ABOVE GRADE WALLS'!G65","v":0},{"$f":"'3.1 - ENV_ABOVE GRADE WALLS'!I65","v":0},null,null,null,"No","No"]
["3.2.3","Above Grade Walls - Insulation and Initial Framing Inspection",{"$f":"'3.1 - ENV_ABOVE GRADE WALLS'!D66","v":"<Select compliance path on the 'Project Info' tab>"},{"$f":"'3.1 - ENV_ABOVE GRADE WALLS'!E66","v":0},{"$f":"'3.1 - ENV_ABOVE GRADE WALLS'!F66","v":0},{"$f":"'3.1 - ENV_ABOVE GRADE WALLS'!G66","v":0},{"$f":"'3.1 - ENV_ABOVE GRADE WALLS'!H66","v":0},{"$f":"'3.1 - ENV_ABOVE GRADE WALLS'!J66","v":0},{"$f":"'3.1 - ENV_ABOVE GRADE WALLS'!G66","v":0},{"$f":"'3.1 - ENV_ABOVE GRADE WALLS'!I66","v":0},null,null,null,"No","No"]
["3.2.3","Above Grade Walls - Floor Perimeter/Plank Edge - Insulation and Framing Inspection",{"$f":"'3.1 - ENV_ABOVE GRADE WALLS'!D67","v":0},{"$f":"'3.1 - ENV_ABOVE GRADE WALLS'!E67","v":0},{"$f":"'3.1 - ENV_ABOVE GRADE WALLS'!F67","v":0},{"$f":"'3.1 - ENV_ABOVE GRADE WALLS'!G67","v":0},{"$f":"'3.1 - ENV_ABOVE GRADE WALLS'!H67","v":0},{"$f":"'3.1 - ENV_ABOVE GRADE WALLS'!J67","v":0},{"$f":"'3.1 - ENV_ABOVE GRADE WALLS'!G67","v":0},{"$f":"'3.1 - ENV_ABOVE GRADE WALLS'!I67","v":0},null,null,null,"No","No"]
["3.2.4","Above Grade Walls - Continuous Insulation Requirements","N/A","N/A",{"$f":"'3.1 - ENV_ABOVE GRADE WALLS'!F68","v":0},{"$f":"'3.1 - ENV_ABOVE GRADE WALLS'!G68","v":0},{"$f":"'3.1 - ENV_ABOVE GRADE WALLS'!H68","v":0},{"$f":"'3.1 - ENV_ABOVE GRADE WALLS'!J68","v":0},{"$f":"'3.1 - ENV_ABOVE GRADE WALLS'!G68","v":0},{"$f":"'3.1 - ENV_ABOVE GRADE WALLS'!I68","v":0},null,null,null,{"$f":"IF(OR(G68=\"No\",G68=0), \"No\", \"Yes\")","v":"No"},{"$f":"IF(OR(J68=\"No\",J68=0), \"No\", \"Yes\")","v":"No"}]
["3.2.5","Above Grade Walls - Wood-Framed Construction","N/A","N/A","N/A","N/A","N/A",{"$f":"'3.1 - ENV_ABOVE GRADE WALLS'!J69","v":0},"N/A",{"$f":"'3.1 - ENV_ABOVE GRADE WALLS'!I69","v":0},null,null,null,"Yes","No"]
["ROOF"]
["3.3.1","Roof - Notes for Drawings and Specifications","N/A","N/A",{"$f":"'3.2 - ENV_ROOF'!$F$26","v":0},{"$f":"'3.2 - ENV_ROOF'!$G$26","v":0},{"$f":"'3.2 - ENV_ROOF'!$H$26","v":0},"N/A","N/A","N/A",null,null,null,{"$f":"IF(OR(G71=\"No\",G71=0), \"No\", \"Yes\")","v":"No"},{"$f":"IF(OR(J71=\"No\",J71=0), \"No\", \"Yes\")","v":"Yes"}]
["3.3.2","Roof - General",{"$f":"'3.2 - ENV_ROOF'!D48","v":0},{"$f":"'3.2 - ENV_ROOF'!E48","v":0},{"$f":"'3.2 - ENV_ROOF'!F48","v":0},{"$f":"'3.2 - ENV_ROOF'!G48","v":0},{"$f":"'3.2 - ENV_ROOF'!H48","v":0},{"$f":"'3.2 - ENV_ROOF'!J48","v":0},{"$f":"'3.2 - ENV_ROOF'!G48","v":0},{"$f":"'3.2 - ENV_ROOF'!I48","v":0},null,null,null,"No","No"]
["3.3.3","Roof - Insulation and Initial Framing Inspection",{"$f":"'3.2 - ENV_ROOF'!D49","v":"<Select compliance path on the 'Project Info' tab>"},{"$f":"'3.2 - ENV_ROOF'!E49","v":0},{"$f":"'3.2 - ENV_ROOF'!F49","v":0},{"$f":"'3.2 - ENV_ROOF'!G49","v":0},{"$f":"'3.2 - ENV_ROOF'!H49","v":0},{"$f":"'3.2 - ENV_ROOF'!J49","v":0},{"$f":"'3.2 - ENV_ROOF'!G49","v":0},{"$f":"'3.2 - ENV_ROOF'!I49","v":0},null,null,null,"No","No"]
["3.3.4","Wood-Framed Construction","N/A","N/A","N/A","N/A","N/A",{"$f":"'3.2 - ENV_ROOF'!J50","v":0},"N/A",{"$f":"'3.2 - ENV_ROOF'!I50","v":0},null,null,null,"Yes","No"]
["FLOORS"]
["3.4.1","Floor - Notes for Drawings and Specifications","N/A","N/A",{"$f":"'3.3 - ENV_FLOORS'!$F$24","v":0},{"$f":"'3.3 - ENV_FLOORS'!$G$24","v":0},{"$f":"'3.3 - ENV_FLOORS'!$H$24","v":0},"N/A","N/A","N/A",null,null,null,{"$f":"IF(OR(G76=\"No\",G76=0), \"No\", \"Yes\")","v":"No"},{"$f":"IF(OR(J76=\"No\",J76=0), \"No\", \"Yes\")","v":"Yes"}]
["3.4.2","Floors - General",{"$f":"'3.3 - ENV_FLOORS'!D67","v":0},{"$f":"'3.3 - ENV_FLOORS'!E67","v":0},{"$f":"'3.3 - ENV_FLOORS'!F67","v":0},{"$f":"'3.3 - ENV_FLOORS'!G67","v":0},{"$f":"'3.3 - ENV_FLOORS'!H67","v":0},{"$f":"'3.3 - ENV_FLOORS'!J67","v":0},{"$f":"'3.3 - ENV_FLOORS'!G67","v":0},{"$f":"'3.3 - ENV_FLOORS'!I67","v":0},null,null,null,"No","No"]
["3.4.3","Floor Insulation Above Unconditioned Space - Insulation and Initial Framing Inspection",{"$f":"'3.3 - ENV_FLOORS'!D68","v":"<Select compliance path on the 'Project Info' tab>"},{"$f":"'3.3 - ENV_FLOORS'!E68","v":0},{"$f":"'3.3 - ENV_FLOORS'!F68","v":0},{"$f":"'3.3 - ENV_FLOORS'!G68","v":0},{"$f":"'3.3 - ENV_FLOORS'!H68","v":0},{"$f":"'3.3 - ENV_FLOORS'!J68","v":0},{"$f":"'3.3 - ENV_FLOORS'!G68","v":0},{"$f":"'3.3 - ENV_FLOORS'!I68","v":0},null,null,null,{"$f":"IF(OR(G78=\"No\",G78=0), \"No\", \"Yes\")","v":"No"},{"$f":"IF(OR(J78=\"No\",J78=0), \"No\", \"Yes\")","v":"No"}]
["3.4.4","Below Grade Slab Floor- Insulation Inspection",{"$f":"'3.3 - ENV_FLOORS'!D69","v":0},{"$f":"'3.3 - ENV_FLOORS'!E69","v":0},{"$f":"'3.3 - ENV_FLOORS'!F69","v":0},{"$f":"'3.3 - ENV_FLOORS'!G69","v":0},{"$f":"'3.3 - ENV_FLOORS'!H69","v":0},{"$f":"'3.3 - ENV_FLOORS'!J69","v":0},{"$f":"'3.3 - ENV_FLOORS'!G69","v":0},{"$f":"'3.3 - ENV_FLOORS'!I69","v":0},null,null,null,"No","No"]
["3.4.5","Slab-on-Grade (unheated) - Insulation Inspection",{"$f":"'3.3 - ENV_FLOORS'!D70","v":0},{"$f":"'3.3 - ENV_FLOORS'!E70","v":0},{"$f":"'3.3 - ENV_FLOORS'!F70","v":0},{"$f":"'3.3 - ENV_FLOORS'!G70","v":0},{"$f":"'3.3 - ENV_FLOORS'!H70","v":0},{"$f":"'3.3 - ENV_FLOORS'!J70","v":0},{"$f":"'3.3 - ENV_FLOORS'!G70","v":0},{"$f":"'3.3 - ENV_FLOORS'!I70","v":0},null,null,null,"No","No"]
["3.4.6","Slab-on-Grade (embedded heated only) - Insulation Inspection",{"$f":"'3.3 - ENV_FLOORS'!D71","v":0},{"$f":"'3.3 - ENV_FLOORS'!E71","v":0},{"$f":"'3.3 - ENV_FLOORS'!F71","v":0},{"$f":"'3.3 - ENV_FLOORS'!G71","v":0},{"$f":"'3.3 - ENV_FLOORS'!H71","v":0},{"$f":"'3.3 - ENV_FLOORS'!J71","v":0},{"$f":"'3.3 - ENV_FLOORS'!G71","v":0},{"$f":"'3.3 - ENV_FLOORS'!I71","v":0},null,null,null,"No","No"]
["3.4.7","Wood-Framed Construction","N/A","N/A","N/A","N/A","N/A",{"$f":"'3.3 - ENV_FLOORS'!J72","v":0},"N/A",{"$f":"'3.3 - ENV_FLOORS'!I72","v":0},null,null,null,"Yes","No"]
["WINDOWS"]
["3.5.1","Windows - Notes for Drawings and Specifications","N/A","N/A",{"$f":"'3.4 - ENV_WINDOWS'!$G$27","v":0},{"$f":"'3.4 - ENV_WINDOWS'!$M$27","v":0},{"$f":"'3.4 - ENV_WINDOWS'!$N$27","v":0},"N/A","N/A","N/A",null,null,null,{"$f":"IF(OR(G84=\"No\",G84=0), \"No\", \"Yes\")","v":"No"},{"$f":"IF(OR(J84=\"No\",J84=0), \"No\", \"Yes\")","v":"Yes"}]
["3.5.2","Windows - General",{"$f":"'3.4 - ENV_WINDOWS'!E39","v":0},{"$f":"'3.4 - ENV_WINDOWS'!F39","v":0},{"$f":"'3.4 - ENV_WINDOWS'!G39","v":0},{"$f":"'3.4 - ENV_WINDOWS'!M39","v":0},{"$f":"'3.4 - ENV_WINDOWS'!N39","v":0},{"$f":"'3.4 - ENV_WINDOWS'!P39","v":0},{"$f":"'3.4 - ENV_WINDOWS'!M39","v":0},{"$f":"'3.4 - ENV_WINDOWS'!O39","v":0},null,null,null,"No","No"]
["3.5.3","Window-to-Wall Ratio","N/A","N/A",{"$f":"'3.4 - ENV_WINDOWS'!G40","v":0},{"$f":"'3.4 - ENV_WINDOWS'!M40","v":0},{"$f":"'3.4 - ENV_WINDOWS'!N40","v":0},{"$f":"'3.4 - ENV_WINDOWS'!P40","v":0},{"$f":"'3.4 - ENV_WINDOWS'!M40","v":0},{"$f":"'3.4 - ENV_WINDOWS'!O40","v":0},null,null,null,{"$f":"IF(OR(G86=\"No\",G86=0), \"No\", \"Yes\")","v":"No"},{"$f":"IF(OR(J86=\"No\",J86=0), \"No\", \"Yes\")","v":"No"}]
["3.5.8","Windows - Manufacturer's Product Data","N/A","N/A","N/A","N/A","N/A",{"$f":"'3.4 - ENV_WINDOWS'!P45","v":0},"N/A",{"$f":"'3.4 - ENV_WINDOWS'!O45","v":0},null,null,null,"Yes","No"]
["3.5.9","Statement of Substantial Completion","N/A","N/A","N/A","N/A","N/A",{"$f":"'3.4 - ENV_WINDOWS'!P46","v":0},"N/A",{"$f":"'3.4 - ENV_WINDOWS'!O46","v":0},null,null,null,"Yes","No"]
["DOORS"]
["3.6.1","Doors - Notes for Drawings and Specifications","N/A","N/A",{"$f":"'3.5 - ENV_EXTERIOR DOORS'!$G$26","v":0},{"$f":"'3.5 - ENV_EXTERIOR DOORS'!$J$26","v":0},{"$f":"'3.5 - ENV_EXTERIOR DOORS'!$K$26","v":0},"N/A","N/A","N/A",null,null,null,{"$f":"IF(OR(G90=\"No\",G90=0), \"No\", \"Yes\")","v":"No"},{"$f":"IF(OR(J90=\"No\",J90=0), \"No\", \"Yes\")","v":"Yes"}]
["3.6.2","Exterior Doors - General",{"$f":"'3.5 - ENV_EXTERIOR DOORS'!E37","v":0},{"$f":"'3.5 - ENV_EXTERIOR DOORS'!F37","v":0},{"$f":"'3.5 - ENV_EXTERIOR DOORS'!G37","v":0},{"$f":"'3.5 - ENV_EXTERIOR DOORS'!J37","v":0},{"$f":"'3.5 - ENV_EXTERIOR DOORS'!K37","v":0},{"$f":"'3.5 - ENV_EXTERIOR DOORS'!M37","v":0},{"$f":"'3.5 - ENV_EXTERIOR DOORS'!J37","v":0},{"$f":"'3.5 - ENV_EXTERIOR DOORS'!L37","v":0},null,null,null,"No","No"]
["3.6.7","Statement of Substantial Completion","N/A","N/A","N/A","N/A","N/A",{"$f":"'3.5 - ENV_EXTERIOR DOORS'!M42","v":0},"N/A",{"$f":"'3.5 - ENV_EXTERIOR DOORS'!L42","v":0},null,null,null,"Yes","No"]
[4,"GARAGES "]
["4.1.1","Garage Heating and Compartmentalzation - Notes for Drawings and Specifications","N/A","N/A",{"$f":"'4.1 - GARAGES_CMPTZ & HEATING '!$F$21","v":0},{"$f":"'4.1 - GARAGES_CMPTZ & HEATING '!$G$21","v":0},{"$f":"'4.1 - GARAGES_CMPTZ & HEATING '!$H$21","v":0},"N/A","N/A","N/A",null,null,null,{"$f":"IF(OR(G94=\"No\",G94=0), \"No\", \"Yes\")","v":"No"},{"$f":"IF(OR(J94=\"No\",J94=0), \"No\", \"Yes\")","v":"Yes"}]
["4.1.2","Garage Heating","N/A","N/A",{"$f":"'4.1 - GARAGES_CMPTZ & HEATING '!F23","v":0},{"$f":"'4.1 - GARAGES_CMPTZ & HEATING '!G23","v":0},{"$f":"'4.1 - GARAGES_CMPTZ & HEATING '!H23","v":0},{"$f":"'4.1 - GARAGES_CMPTZ & HEATING '!J23","v":0},{"$f":"'4.1 - GARAGES_CMPTZ & HEATING '!G23","v":0},{"$f":"'4.1 - GARAGES_CMPTZ & HEATING '!I23","v":0},null,null,null,"No","No"]
["4.1.3","Compartmentalization","N/A","N/A",{"$f":"'4.1 - GARAGES_CMPTZ & HEATING '!F25","v":0},{"$f":"'4.1 - GARAGES_CMPTZ & HEATING '!G25","v":0},{"$f":"'4.1 - GARAGES_CMPTZ & HEATING '!H25","v":0},{"$f":"'4.1 - GARAGES_CMPTZ & HEATING '!J25","v":0},{"$f":"'4.1 - GARAGES_CMPTZ & HEATING '!G25","v":0},{"$f":"'4.1 - GARAGES_CMPTZ & HEATING '!I25","v":0},null,null,null,"No","No"]
["4.1.4","Wood-Framed Construction","N/A","N/A","N/A","N/A","N/A",{"$f":"'4.1 - GARAGES_CMPTZ & HEATING '!J26","v":0},"N/A",{"$f":"'4.1 - GARAGES_CMPTZ & HEATING '!I26","v":0},null,null,null,"Yes","No"]
[5,"COOLING"]
["5.1.1","General",{"$f":"'5.2, 5.4 - COOLING'!E33","v":"see below"},{"$f":"'5.2, 5.4 - COOLING'!F33","v":"see below"},{"$f":"'5.2, 5.4 - COOLING'!G33","v":0},{"$f":"'5.2, 5.4 - COOLING'!N33","v":0},{"$f":"'5.2, 5.4 - COOLING'!O33","v":0},{"$f":"'5.2, 5.4 - COOLING'!Q33","v":0},{"$f":"'5.2, 5.4 - COOLING'!N33","v":0},{"$f":"'5.2, 5.4 - COOLING'!P33","v":0},null,null,null,"No","No"]
["MODELING INPUTS"]
["5.2.1","Space Cooling - Type and Efficiency",{"$f":"'5.2, 5.4 - COOLING'!E35","v":0},{"$f":"'5.2, 5.4 - COOLING'!F35","v":0},{"$f":"'5.2, 5.4 - COOLING'!G35","v":0},{"$f":"'5.2, 5.4 - COOLING'!N35","v":0},{"$f":"'5.2, 5.4 - COOLING'!O35","v":0},{"$f":"'5.2, 5.4 - COOLING'!Q35","v":0},{"$f":"'5.2, 5.4 - COOLING'!N35","v":0},{"$f":"'5.2, 5.4 - COOLING'!P35","v":0},null,null,null,"No","No"]
["5.2.2","Space Cooling  - Sizing",{"$f":"'5.2, 5.4 - COOLING'!E36","v":0},{"$f":"'5.2, 5.4 - COOLING'!F36","v":0},{"$f":"'5.2, 5.4 - COOLING'!G36","v":0},{"$f":"'5.2, 5.4 - COOLING'!N36","v":0},{"$f":"'5.2, 5.4 - COOLING'!O36","v":0},{"$f":"'5.2, 5.4 - COOLING'!Q36","v":0},{"$f":"'5.2, 5.4 - COOLING'!N36","v":0},{"$f":"'5.2, 5.4 - COOLING'!P36","v":0},null,null,null,"No","No"]
["5.2.3","Space Cooling  - Controls",{"$f":"'5.2, 5.4 - COOLING'!E38","v":0},{"$f":"'5.2, 5.4 - COOLING'!F38","v":0},{"$f":"'5.2, 5.4 - COOLING'!G38","v":0},{"$f":"'5.2, 5.4 - COOLING'!N38","v":0},{"$f":"'5.2, 5.4 - COOLING'!O38","v":0},{"$f":"'5.2, 5.4 - COOLING'!Q38","v":0},{"$f":"'5.2, 5.4 - COOLING'!N38","v":0},{"$f":"'5.2, 5.4 - COOLING'!P38","v":0},null,null,null,{"$f":"IF(OR(G103=\"No\",G103=0), \"No\", \"Yes\")","v":"No"},{"$f":"IF(OR(J103=\"No\",J103=0), \"No\", \"Yes\")","v":"No"}]
["CHILLED WATER AND CONDENSER WATER SYSTEMS"]
["5.3.1","Cooling Distribution - Piping Configuration","N/A","N/A",{"$f":"'5.2, 5.4 - COOLING'!G40","v":0},{"$f":"'5.2, 5.4 - COOLING'!N40","v":0},{"$f":"'5.2, 5.4 - COOLING'!O40","v":0},{"$f":"'5.2, 5.4 - COOLING'!Q40","v":0},{"$f":"'5.2, 5.4 - COOLING'!N40","v":0},{"$f":"'5.2, 5.4 - COOLING'!P40","v":0},null,null,null,"No","No"]
["5.3.2","Cooling Distribution - Pump Sizing","N/A","N/A",{"$f":"'5.2, 5.4 - COOLING'!G41","v":0},{"$f":"'5.2, 5.4 - COOLING'!N41","v":0},{"$f":"'5.2, 5.4 - COOLING'!O41","v":0},{"$f":"'5.2, 5.4 - COOLING'!Q41","v":0},{"$f":"'5.2, 5.4 - COOLING'!N41","v":0},{"$f":"'5.2, 5.4 - COOLING'!P41","v":0},null,null,null,"No","No"]
["5.3.3","Cooling Distribution - Pressure Control Set-points","N/A","N/A",{"$f":"'5.2, 5.4 - COOLING'!G42","v":0},{"$f":"'5.2, 5.4 - COOLING'!N42","v":0},{"$f":"'5.2, 5.4 - COOLING'!O42","v":0},{"$f":"'5.2, 5.4 - COOLING'!Q42","v":0},{"$f":"'5.2, 5.4 - COOLING'!N42","v":0},{"$f":"'5.2, 5.4 - COOLING'!P42","v":0},null,null,null,{"$f":"IF(OR(G107=\"No\",G107=0), \"No\", \"Yes\")","v":"No"},{"$f":"IF(OR(J107=\"No\",J107=0), \"No\", \"Yes\")","v":"No"}]
["5.3.4","Cooling Distribution - Pipe Insulation","N/A","N/A",{"$f":"'5.2, 5.4 - COOLING'!G43","v":0},{"$f":"'5.2, 5.4 - COOLING'!N43","v":0},{"$f":"'5.2, 5.4 - COOLING'!O43","v":0},{"$f":"'5.2, 5.4 - COOLING'!Q43","v":0},{"$f":"'5.2, 5.4 - COOLING'!N43","v":0},{"$f":"'5.2, 5.4 - COOLING'!P43","v":0},null,null,null,"No","No"]
["5.3.5","Cooling Terminal Units - Thermostatic Controls","N/A","N/A",{"$f":"'5.2, 5.4 - COOLING'!G44","v":0},{"$f":"'5.2, 5.4 - COOLING'!N44","v":0},{"$f":"'5.2, 5.4 - COOLING'!O44","v":0},{"$f":"'5.2, 5.4 - COOLING'!Q44","v":0},{"$f":"'5.2, 5.4 - COOLING'!N44","v":0},{"$f":"'5.2, 5.4 - COOLING'!P44","v":0},null,null,null,"No","No"]
["5.3.6","Cooling System - Airflow and Nameplate Data","N/A","N/A","N/A","N/A","N/A",{"$f":"'5.2, 5.4 - COOLING'!Q45","v":0},"N/A",{"$f":"'5.2, 5.4 - COOLING'!P45","v":0},null,null,null,"Yes","No"]
["ALL FORCED AIR COOLING SYSTEMS (Including heat pumps, split system ACs, PTACs and room ACs)"]
["5.4.1","Cooling Distribution System - In-Unit Duct Sizing","N/A","N/A",{"$f":"'5.2, 5.4 - COOLING'!G47","v":0},{"$f":"'5.2, 5.4 - COOLING'!N47","v":0},{"$f":"'5.2, 5.4 - COOLING'!O47","v":0},{"$f":"'5.2, 5.4 - COOLING'!Q47","v":0},{"$f":"'5.2, 5.4 - COOLING'!N47","v":0},{"$f":"'5.2, 5.4 - COOLING'!P47","v":0},null,null,null,"No","No"]
["5.4.2","Cooling Distribution System - In-Unit Pressure Balancing","N/A","N/A",{"$f":"'5.2, 5.4 - COOLING'!G48","v":0},{"$f":"'5.2, 5.4 - COOLING'!N48","v":0},{"$f":"'5.2, 5.4 - COOLING'!O48","v":0},{"$f":"'5.2, 5.4 - COOLING'!Q48","v":0},{"$f":"'5.2, 5.4 - COOLING'!N48","v":0},{"$f":"'5.2, 5.4 - COOLING'!P48","v":0},null,null,null,{"$f":"IF(OR(G113=\"No\",G113=0), \"No\", \"Yes\")","v":"No"},{"$f":"IF(OR(J113=\"No\",J113=0), \"No\", \"Yes\")","v":"No"}]
["5.4.3","Cooling Distribution - Duct Insulation","N/A","N/A",{"$f":"'5.2, 5.4 - COOLING'!G49","v":0},{"$f":"'5.2, 5.4 - COOLING'!N49","v":0},{"$f":"'5.2, 5.4 - COOLING'!O49","v":0},{"$f":"'5.2, 5.4 - COOLING'!Q49","v":0},{"$f":"'5.2, 5.4 - COOLING'!N49","v":0},{"$f":"'5.2, 5.4 - COOLING'!P49","v":0},null,null,null,"No","No"]
["5.4.4","Cooling System - Outdoor Air Damper","N/A","N/A",{"$f":"'5.2, 5.4 - COOLING'!G50","v":0},{"$f":"'5.2, 5.4 - COOLING'!N50","v":0},{"$f":"'5.2, 5.4 - COOLING'!O50","v":0},{"$f":"'5.2, 5.4 - COOLING'!Q50","v":0},{"$f":"'5.2, 5.4 - COOLING'!N50","v":0},{"$f":"'5.2, 5.4 - COOLING'!P50","v":0},null,null,null,"No","No"]
["5.4.5","Cooling Distribution - Duct Sealing Details","N/A","N/A",{"$f":"'5.2, 5.4 - COOLING'!G51","v":0},{"$f":"'5.2, 5.4 - COOLING'!N51","v":0},{"$f":"'5.2, 5.4 - COOLING'!O51","v":0},{"$f":"'5.2, 5.4 - COOLING'!Q51","v":0},{"$f":"'5.2, 5.4 - COOLING'!N51","v":0},{"$f":"'5.2, 5.4 - COOLING'!P51","v":0},null,null,null,"No","No"]
["5.4.6","Cooling Distribution - Flex Duct Installation","N/A","N/A",{"$f":"'5.2, 5.4 - COOLING'!G52","v":0},{"$f":"'5.2, 5.4 - COOLING'!N52","v":0},{"$f":"'5.2, 5.4 - COOLING'!O52","v":0},{"$f":"'5.2, 5.4 - COOLING'!Q52","v":0},{"$f":"'5.2, 5.4 - COOLING'!N52","v":0},{"$f":"'5.2, 5.4 - COOLING'!P52","v":0},null,null,null,"No","No"]
["5.4.7","Cooling System - HVAC Contractor Checklist","N/A","N/A","N/A","N/A","N/A",{"$f":"'5.2, 5.4 - COOLING'!Q54","v":0},"N/A",{"$f":"'5.2, 5.4 - COOLING'!P54","v":0},null,null,null,"Yes","No"]
["5.4.8","Cooling Distribution - In-Unit Duct Leakage Testing","N/A","N/A","N/A","N/A","N/A",{"$f":"'5.2, 5.4 - COOLING'!Q53","v":0},"N/A",{"$f":"'5.2, 5.4 - COOLING'!P53","v":0},null,null,null,"Yes","No"]
["5.4.9","Cooling System - Refrigerant Charge, Airflow and Nameplate Data","N/A","N/A","N/A","N/A","N/A",{"$f":"'5.2, 5.4 - COOLING'!Q55","v":0},"N/A",{"$f":"'5.2, 5.4 - COOLING'!P55","v":0},null,null,null,"Yes","No"]
["COOLING SYSTEMS MISC"]
["5.5.1","Cooling - A/C Sleeves","N/A","N/A",{"$f":"'5.2, 5.4 - COOLING'!G57","v":0},{"$f":"'5.2, 5.4 - COOLING'!N57","v":0},{"$f":"'5.2, 5.4 - COOLING'!O57","v":0},{"$f":"'5.2, 5.4 - COOLING'!Q57","v":0},{"$f":"'5.2, 5.4 - COOLING'!N57","v":0},{"$f":"'5.2, 5.4 - COOLING'!P57","v":0},null,null,null,"No","No"]
["5.5.2","Cooling Distribution - Thermostat","N/A","N/A",{"$f":"'5.2, 5.4 - COOLING'!G58","v":0},{"$f":"'5.2, 5.4 - COOLING'!N58","v":0},{"$f":"'5.2, 5.4 - COOLING'!O58","v":0},{"$f":"'5.2, 5.4 - COOLING'!Q58","v":0},{"$f":"'5.2, 5.4 - COOLING'!N58","v":0},{"$f":"'5.2, 5.4 - COOLING'!P58","v":0},null,null,null,"No","No"]
["5.5.5","Statement of Substantial Completion - HVAC","N/A","N/A","N/A","N/A","N/A",{"$f":"'5.2, 5.4 - COOLING'!#REF!","v":{"$error":"#REF!"}},"N/A",{"$f":"'5.2, 5.4 - COOLING'!#REF!","v":{"$error":"#REF!"}},null,null,null,"Yes",{"$error":"#REF!"}]
[6,"LIGHTING"]
["6.1.1","Common Area, In-Unit, Garage and Exterior Lighting - Notes for Drawings and Specifications","N/A","N/A",{"$f":"'6.1, 6.2, 6.3 - LIGHTING'!#REF!","v":{"$error":"#REF!"}},{"$f":"'6.1, 6.2, 6.3 - LIGHTING'!#REF!","v":{"$error":"#REF!"}},{"$f":"'6.1, 6.2, 6.3 - LIGHTING'!#REF!","v":{"$error":"#REF!"}},"N/A","N/A","N/A",null,null,null,{"$f":"IF(OR(G126=\"No\",G126=0), \"No\", \"Yes\")","v":{"$error":"#REF!"}},{"$f":"IF(OR(J126=\"No\",J126=0), \"No\", \"Yes\")","v":"Yes"}]
["6.1.2","Emergency Lighting, Exit Signs - Notes for Drawings and Specifications","N/A","N/A",{"$f":"'6.1, 6.2, 6.3 - LIGHTING'!#REF!","v":{"$error":"#REF!"}},{"$f":"'6.1, 6.2, 6.3 - LIGHTING'!#REF!","v":{"$error":"#REF!"}},{"$f":"'6.1, 6.2, 6.3 - LIGHTING'!#REF!","v":{"$error":"#REF!"}},"N/A","N/A","N/A",null,null,null,{"$f":"IF(OR(G127=\"No\",G127=0), \"No\", \"Yes\")","v":{"$error":"#REF!"}},{"$f":"IF(OR(J127=\"No\",J127=0), \"No\", \"Yes\")","v":"Yes"}]
["6.1.3","Lighting Controls - Notes for Drawings and Specifications","N/A","N/A",{"$f":"'6.1, 6.2, 6.3 - LIGHTING'!#REF!","v":{"$error":"#REF!"}},{"$f":"'6.1, 6.2, 6.3 - LIGHTING'!#REF!","v":{"$error":"#REF!"}},{"$f":"'6.1, 6.2, 6.3 - LIGHTING'!#REF!","v":{"$error":"#REF!"}},"N/A","N/A","N/A",null,null,null,{"$f":"IF(OR(G128=\"No\",G128=0), \"No\", \"Yes\")","v":{"$error":"#REF!"}},{"$f":"IF(OR(J128=\"No\",J128=0), \"No\", \"Yes\")","v":"Yes"}]
["6.1.4","Lighting Power Density","N/A","N/A",{"$f":"'6.1, 6.2, 6.3 - LIGHTING'!J28","v":0},{"$f":"'6.1, 6.2, 6.3 - LIGHTING'!K28","v":0},{"$f":"'6.1, 6.2, 6.3 - LIGHTING'!L28","v":0},{"$f":"'6.1, 6.2, 6.3 - LIGHTING'!N28","v":0},{"$f":"'6.1, 6.2, 6.3 - LIGHTING'!K28","v":0},{"$f":"'6.1, 6.2, 6.3 - LIGHTING'!M28","v":0},null,null,null,"No","No"]
["6.1.5","Lighting Controls - Verification",{"$f":"'6.1, 6.2, 6.3 - LIGHTING'!F97","v":0},{"$f":"'6.1, 6.2, 6.3 - LIGHTING'!H97","v":0},{"$f":"'6.1, 6.2, 6.3 - LIGHTING'!J97","v":0},{"$f":"'6.1, 6.2, 6.3 - LIGHTING'!K97","v":0},{"$f":"'6.1, 6.2, 6.3 - LIGHTING'!L97","v":0},{"$f":"'6.1, 6.2, 6.3 - LIGHTING'!N97","v":0},{"$f":"'6.1, 6.2, 6.3 - LIGHTING'!K97","v":0},{"$f":"'6.1, 6.2, 6.3 - LIGHTING'!M97","v":0},null,null,null,"No","No"]
["6.1.6","Common Area Lighting - 24/7",{"$f":"'6.1, 6.2, 6.3 - LIGHTING'!F98","v":0},{"$f":"'6.1, 6.2, 6.3 - LIGHTING'!H98","v":0},{"$f":"'6.1, 6.2, 6.3 - LIGHTING'!J98","v":0},{"$f":"'6.1, 6.2, 6.3 - LIGHTING'!K98","v":0},{"$f":"'6.1, 6.2, 6.3 - LIGHTING'!L98","v":0},{"$f":"'6.1, 6.2, 6.3 - LIGHTING'!N98","v":0},{"$f":"'6.1, 6.2, 6.3 - LIGHTING'!K98","v":0},{"$f":"'6.1, 6.2, 6.3 - LIGHTING'!M98","v":0},null,null,null,"No","No"]
["6.1.7","Common Area Lighting - Non 24/7",{"$f":"'6.1, 6.2, 6.3 - LIGHTING'!F99","v":0},{"$f":"'6.1, 6.2, 6.3 - LIGHTING'!H99","v":0},{"$f":"'6.1, 6.2, 6.3 - LIGHTING'!J99","v":0},{"$f":"'6.1, 6.2, 6.3 - LIGHTING'!K99","v":0},{"$f":"'6.1, 6.2, 6.3 - LIGHTING'!L99","v":0},{"$f":"'6.1, 6.2, 6.3 - LIGHTING'!N99","v":0},{"$f":"'6.1, 6.2, 6.3 - LIGHTING'!K99","v":0},{"$f":"'6.1, 6.2, 6.3 - LIGHTING'!M99","v":0},null,null,null,"No","No"]
["6.1.8","Emergency Lighting - Exit Signs",{"$f":"'6.1, 6.2, 6.3 - LIGHTING'!F100","v":0},{"$f":"'6.1, 6.2, 6.3 - LIGHTING'!H100","v":0},{"$f":"'6.1, 6.2, 6.3 - LIGHTING'!J100","v":0},{"$f":"'6.1, 6.2, 6.3 - LIGHTING'!K100","v":0},{"$f":"'6.1, 6.2, 6.3 - LIGHTING'!L100","v":0},{"$f":"'6.1, 6.2, 6.3 - LIGHTING'!N100","v":0},{"$f":"'6.1, 6.2, 6.3 - LIGHTING'!K100","v":0},{"$f":"'6.1, 6.2, 6.3 - LIGHTING'!M100","v":0},null,null,null,"No","No"]
["6.1.9","Exterior, Security & Decorative Lighting  ",{"$f":"'6.1, 6.2, 6.3 - LIGHTING'!F101","v":0},{"$f":"'6.1, 6.2, 6.3 - LIGHTING'!H101","v":0},{"$f":"'6.1, 6.2, 6.3 - LIGHTING'!J101","v":0},{"$f":"'6.1, 6.2, 6.3 - LIGHTING'!K101","v":0},{"$f":"'6.1, 6.2, 6.3 - LIGHTING'!L101","v":0},{"$f":"'6.1, 6.2, 6.3 - LIGHTING'!N101","v":0},{"$f":"'6.1, 6.2, 6.3 - LIGHTING'!K101","v":0},{"$f":"'6.1, 6.2, 6.3 - LIGHTING'!M101","v":0},null,null,null,"No","No"]
["6.1.10","Garage Lighting",{"$f":"'6.1, 6.2, 6.3 - LIGHTING'!#REF!","v":{"$error":"#REF!"}},{"$f":"'6.1, 6.2, 6.3 - LIGHTING'!#REF!","v":{"$error":"#REF!"}},{"$f":"'6.1, 6.2, 6.3 - LIGHTING'!#REF!","v":{"$error":"#REF!"}},{"$f":"'6.1, 6.2, 6.3 - LIGHTING'!#REF!","v":{"$error":"#REF!"}},{"$f":"'6.1, 6.2, 6.3 - LIGHTING'!#REF!","v":{"$error":"#REF!"}},{"$f":"'6.1, 6.2, 6.3 - LIGHTING'!#REF!","v":{"$error":"#REF!"}},{"$f":"'6.1, 6.2, 6.3 - LIGHTING'!#REF!","v":{"$error":"#REF!"}},{"$f":"'6.1, 6.2, 6.3 - LIGHTING'!#REF!","v":{"$error":"#REF!"}},null,null,null,{"$error":"#REF!"},{"$error":"#REF!"}]
["6.1.11","In-Unit Lighting  ",{"$f":"'6.1, 6.2, 6.3 - LIGHTING'!F104","v":0},{"$f":"'6.1, 6.2, 6.3 - LIGHTING'!H104","v":0},{"$f":"'6.1, 6.2, 6.3 - LIGHTING'!J104","v":0},{"$f":"'6.1, 6.2, 6.3 - LIGHTING'!K104","v":0},{"$f":"'6.1, 6.2, 6.3 - LIGHTING'!L104","v":0},{"$f":"'6.1, 6.2, 6.3 - LIGHTING'!N104","v":0},{"$f":"'6.1, 6.2, 6.3 - LIGHTING'!K104","v":0},{"$f":"'6.1, 6.2, 6.3 - LIGHTING'!M104","v":0},null,null,null,"No","No"]
["INSPECTION ONLY"]
["6.2.1","Lighting - Ballasts","N/A","N/A","N/A","N/A","N/A",{"$f":"'6.1, 6.2, 6.3 - LIGHTING'!N105","v":0},"N/A",{"$f":"'6.1, 6.2, 6.3 - LIGHTING'!M105","v":0},null,null,null,"Yes","No"]
["6.2.2","Lighting - Statement of Substantial Completion - Non 24/7 Spaces","N/A","N/A","N/A","N/A","N/A",{"$f":"'6.1, 6.2, 6.3 - LIGHTING'!N106","v":0},"N/A",{"$f":"'6.1, 6.2, 6.3 - LIGHTING'!M106","v":0},null,null,null,{"$f":"IF(OR(G139=\"No\",G139=0), \"No\", \"Yes\")","v":"Yes"},{"$f":"IF(OR(J139=\"No\",J139=0), \"No\", \"Yes\")","v":"No"}]
["6.2.3","Lighting - Statement of Substantial Completion - 24/7 Spaces","N/A","N/A","N/A","N/A","N/A",{"$f":"'6.1, 6.2, 6.3 - LIGHTING'!N107","v":0},"N/A",{"$f":"'6.1, 6.2, 6.3 - LIGHTING'!M107","v":0},null,null,null,"Yes","No"]
[7,"MOTORS"]
["7.1.1","Motors - Notes for Drawings and Specifications","N/A","N/A",{"$f":"'7.1 - MOTORS'!$H$23","v":0},{"$f":"'7.1 - MOTORS'!$J$23","v":0},{"$f":"'7.1 - MOTORS'!$K$23","v":0},"N/A","N/A","N/A",null,null,null,{"$f":"IF(OR(G142=\"No\",G142=0), \"No\", \"Yes\")","v":"No"},{"$f":"IF(OR(J142=\"No\",J142=0), \"No\", \"Yes\")","v":"Yes"}]
["7.1.2","General",{"$f":"'7.1 - MOTORS'!#REF!","v":{"$error":"#REF!"}},{"$f":"'7.1 - MOTORS'!#REF!","v":{"$error":"#REF!"}},{"$f":"'7.1 - MOTORS'!#REF!","v":{"$error":"#REF!"}},{"$f":"'7.1 - MOTORS'!#REF!","v":{"$error":"#REF!"}},{"$f":"'7.1 - MOTORS'!#REF!","v":{"$error":"#REF!"}},{"$f":"'7.1 - MOTORS'!#REF!","v":{"$error":"#REF!"}},{"$f":"'7.1 - MOTORS'!#REF!","v":{"$error":"#REF!"}},{"$f":"'7.1 - MOTORS'!#REF!","v":{"$error":"#REF!"}},null,null,null,{"$error":"#REF!"},{"$error":"#REF!"}]
["7.1.3","Heating and Cooling Distribution - Motors",{"$f":"'7.1 - MOTORS'!F34","v":0},{"$f":"'7.1 - MOTORS'!G34","v":0},{"$f":"'7.1 - MOTORS'!H34","v":0},{"$f":"'7.1 - MOTORS'!J34","v":0},{"$f":"'7.1 - MOTORS'!K34","v":0},{"$f":"'7.1 - MOTORS'!M34","v":0},{"$f":"'7.1 - MOTORS'!J34","v":0},{"$f":"'7.1 - MOTORS'!L34","v":0},null,null,null,"No","No"]
["7.1.4","DHW Distribution - Motors",{"$f":"'7.1 - MOTORS'!F36","v":0},{"$f":"'7.1 - MOTORS'!G36","v":0},{"$f":"'7.1 - MOTORS'!H36","v":0},{"$f":"'7.1 - MOTORS'!J36","v":0},{"$f":"'7.1 - MOTORS'!K36","v":0},{"$f":"'7.1 - MOTORS'!M36","v":0},{"$f":"'7.1 - MOTORS'!J36","v":0},{"$f":"'7.1 - MOTORS'!L36","v":0},null,null,null,"No","No"]
["7.1.7","Statement of Substantial Completion","N/A","N/A","N/A","N/A","N/A",{"$f":"'7.1 - MOTORS'!M39","v":0},"N/A",{"$f":"'7.1 - MOTORS'!L39","v":0},null,null,null,"Yes","No"]
[8,"INFILTRATION"]
["EXTERIOR AIR BARRIERS"]
["8.1.1","General Exterior Enclosure - Notes for Drawings and Specifications","N/A","N/A",{"$f":"'8.1 - INF_EXT AIR BARRIER'!$F$31","v":0},{"$f":"'8.1 - INF_EXT AIR BARRIER'!$G$31","v":0},{"$f":"'8.1 - INF_EXT AIR BARRIER'!$H$31","v":0},"N/A","N/A","N/A",null,null,null,{"$f":"IF(OR(G149=\"No\",G149=0), \"No\", \"Yes\")","v":"No"},{"$f":"IF(OR(J149=\"No\",J149=0), \"No\", \"Yes\")","v":"Yes"}]
["8.1.2","Exterior Enclosure Air Barriers- Notes for Drawings and Specifications","N/A","N/A",{"$f":"'8.1 - INF_EXT AIR BARRIER'!$F$32","v":0},{"$f":"'8.1 - INF_EXT AIR BARRIER'!$G$32","v":0},{"$f":"'8.1 - INF_EXT AIR BARRIER'!$H$32","v":0},"N/A","N/A","N/A",null,null,null,{"$f":"IF(OR(G150=\"No\",G150=0), \"No\", \"Yes\")","v":"No"},{"$f":"IF(OR(J150=\"No\",J150=0), \"No\", \"Yes\")","v":"Yes"}]
["8.1.3","Exterior Air Barrier - General","N/A","N/A",{"$f":"'8.1 - INF_EXT AIR BARRIER'!F47","v":0},{"$f":"'8.1 - INF_EXT AIR BARRIER'!G47","v":0},{"$f":"'8.1 - INF_EXT AIR BARRIER'!H47","v":0},{"$f":"'8.1 - INF_EXT AIR BARRIER'!J47","v":0},{"$f":"'8.1 - INF_EXT AIR BARRIER'!G47","v":0},{"$f":"'8.1 - INF_EXT AIR BARRIER'!I47","v":0},null,null,null,"No","No"]
["8.1.4","Wood-Framed Construction","N/A","N/A",{"$f":"'8.1 - INF_EXT AIR BARRIER'!F48","v":0},{"$f":"'8.1 - INF_EXT AIR BARRIER'!G48","v":0},{"$f":"'8.1 - INF_EXT AIR BARRIER'!H48","v":0},{"$f":"'8.1 - INF_EXT AIR BARRIER'!J48","v":0},{"$f":"'8.1 - INF_EXT AIR BARRIER'!G48","v":0},{"$f":"'8.1 - INF_EXT AIR BARRIER'!I48","v":0},null,null,null,"No","No"]
["COMPARTMENTALIZATION - VISUAL INSPECTION"]
["8.2.1","Compartmentalization - Notes for Drawings and Specifications","N/A","N/A",{"$f":"'8.1-INF_COMPTZN VIS INSPECTION'!$F$29","v":0},{"$f":"'8.1-INF_COMPTZN VIS INSPECTION'!$G$29","v":0},{"$f":"'8.1-INF_COMPTZN VIS INSPECTION'!$H$29","v":0},"N/A","N/A","N/A",null,null,null,{"$f":"IF(OR(G154=\"No\",G154=0), \"No\", \"Yes\")","v":"No"},{"$f":"IF(OR(J154=\"No\",J154=0), \"No\", \"Yes\")","v":"Yes"}]
["8.2.2","Compartmentalization Visual Inspection - General","N/A","N/A",{"$f":"'8.1-INF_COMPTZN VIS INSPECTION'!F31","v":0},{"$f":"'8.1-INF_COMPTZN VIS INSPECTION'!G31","v":0},{"$f":"'8.1-INF_COMPTZN VIS INSPECTION'!H31","v":0},{"$f":"'8.1-INF_COMPTZN VIS INSPECTION'!J31","v":0},{"$f":"'8.1-INF_COMPTZN VIS INSPECTION'!G31","v":0},{"$f":"'8.1-INF_COMPTZN VIS INSPECTION'!I31","v":0},null,null,null,"No","No"]
["BLOWER DOOR TESTING"]
["8.3.1","Blower Door Test - Notes for Drawings and Specifications","N/A","N/A",{"$f":"'8.1-INF_COMPTZN VIS INSPECTION'!$F$29","v":0},{"$f":"'8.1-INF_COMPTZN VIS INSPECTION'!$G$29","v":0},{"$f":"'8.1-INF_COMPTZN VIS INSPECTION'!$H$29","v":0},"N/A","N/A","N/A",null,null,null,{"$f":"IF(OR(G157=\"No\",G157=0), \"No\", \"Yes\")","v":"No"},{"$f":"IF(OR(J157=\"No\",J157=0), \"No\", \"Yes\")","v":"Yes"}]
["8.3.2","Blower Door Test - General","N/A","N/A",{"$f":"'8.1 - INF_BLOWER DOOR TEST'!H33","v":0},{"$f":"'8.1 - INF_BLOWER DOOR TEST'!I33","v":0},{"$f":"'8.1 - INF_BLOWER DOOR TEST'!J33","v":0},{"$f":"'8.1 - INF_BLOWER DOOR TEST'!L33","v":0},{"$f":"'8.1 - INF_BLOWER DOOR TEST'!I33","v":0},{"$f":"'8.1 - INF_BLOWER DOOR TEST'!K33","v":0},null,null,null,"No","No"]
["8.3.3","Preliminary Testing","N/A","N/A","N/A","N/A","N/A",{"$f":"'8.1 - INF_BLOWER DOOR TEST'!L34","v":0},"N/A",{"$f":"'8.1 - INF_BLOWER DOOR TEST'!K34","v":0},null,null,null,"Yes","No"]
["8.3.4","Final Verification Testing","N/A","N/A","N/A","N/A","N/A",{"$f":"'8.1 - INF_BLOWER DOOR TEST'!L35","v":0},"N/A",{"$f":"'8.1 - INF_BLOWER DOOR TEST'!K35","v":0},null,null,null,{"$f":"IF(OR(G160=\"No\",G160=0), \"No\", \"Yes\")","v":"Yes"},{"$f":"IF(OR(J160=\"No\",J160=0), \"No\", \"Yes\")","v":"No"}]
["8.3.5","Fan Pressure Testing Method","N/A","N/A","N/A","N/A","N/A",{"$f":"'8.1 - INF_BLOWER DOOR TEST'!L36","v":0},"N/A",{"$f":"'8.1 - INF_BLOWER DOOR TEST'!K36","v":0},null,null,null,"Yes","No"]
[8.5,"VENTILATION"]
["8.5.1","Ventilation - Notes for Drawings and Specifications","N/A","N/A",{"$f":"'8.2 - VENT_SCHEDULE&TAB REPORT'!$H$33","v":0},{"$f":"'8.2 - VENT_SCHEDULE&TAB REPORT'!$O$33","v":0},{"$f":"'8.2 - VENT_SCHEDULE&TAB REPORT'!$P$33","v":0},"N/A","N/A","N/A",null,null,null,{"$f":"IF(OR(G163=\"No\",G163=0), \"No\", \"Yes\")","v":"No"},{"$f":"IF(OR(J163=\"No\",J163=0), \"No\", \"Yes\")","v":"Yes"}]
["8.5.2","Ventilation Prescriptive Path - Notes for Drawings and Specifications","N/A","N/A",{"$f":"'8.2 - VENT_SCHEDULE&TAB REPORT'!$H$34","v":0},{"$f":"'8.2 - VENT_SCHEDULE&TAB REPORT'!$O$34","v":0},{"$f":"'8.2 - VENT_SCHEDULE&TAB REPORT'!$P$34","v":0},"N/A","N/A","N/A",null,null,null,{"$f":"IF(OR(G164=\"No\",G164=0), \"No\", \"Yes\")","v":"No"},{"$f":"IF(OR(J164=\"No\",J164=0), \"No\", \"Yes\")","v":"Yes"}]
["8.5.3","Garage Ventilation - Notes for Drawings and Specifications","N/A","N/A",{"$f":"'8.2 - VENT_SCHEDULE&TAB REPORT'!$H$35","v":0},{"$f":"'8.2 - VENT_SCHEDULE&TAB REPORT'!$O$35","v":0},{"$f":"'8.2 - VENT_SCHEDULE&TAB REPORT'!$P$35","v":0},"N/A","N/A","N/A",null,null,null,{"$f":"IF(OR(G165=\"No\",G165=0), \"No\", \"Yes\")","v":"No"},{"$f":"IF(OR(J165=\"No\",J165=0), \"No\", \"Yes\")","v":"Yes"}]
["MODELING INPUTS - SIZING AND BALANCING"]
["8.6.1","Non - Apartment Fan Efficiency",{"$f":"'8.2 - VENT_SCHEDULE&TAB REPORT'!F52","v":0},{"$f":"'8.2 - VENT_SCHEDULE&TAB REPORT'!G52","v":0},{"$f":"'8.2 - VENT_SCHEDULE&TAB REPORT'!H52","v":0},{"$f":"'8.2 - VENT_SCHEDULE&TAB REPORT'!O52","v":0},{"$f":"'8.2 - VENT_SCHEDULE&TAB REPORT'!P52","v":0},{"$f":"'8.2 - VENT_SCHEDULE&TAB REPORT'!R52","v":0},{"$f":"'8.2 - VENT_SCHEDULE&TAB REPORT'!O52","v":0},{"$f":"'8.2 - VENT_SCHEDULE&TAB REPORT'!Q52","v":0},null,null,null,"No","No"]
["8.6.2","Apartment Fan Efficiency (Roof)",{"$f":"'8.2 - VENT_SCHEDULE&TAB REPORT'!F53","v":0},{"$f":"'8.2 - VENT_SCHEDULE&TAB REPORT'!G53","v":0},{"$f":"'8.2 - VENT_SCHEDULE&TAB REPORT'!H53","v":0},{"$f":"'8.2 - VENT_SCHEDULE&TAB REPORT'!O53","v":0},{"$f":"'8.2 - VENT_SCHEDULE&TAB REPORT'!P53","v":0},{"$f":"'8.2 - VENT_SCHEDULE&TAB REPORT'!R53","v":0},{"$f":"'8.2 - VENT_SCHEDULE&TAB REPORT'!O53","v":0},{"$f":"'8.2 - VENT_SCHEDULE&TAB REPORT'!Q53","v":0},null,null,null,"No","No"]
["8.6.3","Apartment Fan Efficiency (In-Unit)",{"$f":"'8.2 - VENT_SCHEDULE&TAB REPORT'!F54","v":0},{"$f":"'8.2 - VENT_SCHEDULE&TAB REPORT'!G54","v":0},{"$f":"'8.2 - VENT_SCHEDULE&TAB REPORT'!H54","v":0},{"$f":"'8.2 - VENT_SCHEDULE&TAB REPORT'!O54","v":0},{"$f":"'8.2 - VENT_SCHEDULE&TAB REPORT'!P54","v":0},{"$f":"'8.2 - VENT_SCHEDULE&TAB REPORT'!R54","v":0},{"$f":"'8.2 - VENT_SCHEDULE&TAB REPORT'!O54","v":0},{"$f":"'8.2 - VENT_SCHEDULE&TAB REPORT'!Q54","v":0},null,null,null,"No","No"]
["8.6.4","Apartment and Non-Corridor - Capacity, Testing and Balancing",{"$f":"'8.2 - VENT_SCHEDULE&TAB REPORT'!F56","v":0},{"$f":"'8.2 - VENT_SCHEDULE&TAB REPORT'!G56","v":0},{"$f":"'8.2 - VENT_SCHEDULE&TAB REPORT'!H56","v":0},{"$f":"'8.2 - VENT_SCHEDULE&TAB REPORT'!O56","v":0},{"$f":"'8.2 - VENT_SCHEDULE&TAB REPORT'!P56","v":0},{"$f":"'8.2 - VENT_SCHEDULE&TAB REPORT'!R56","v":0},{"$f":"'8.2 - VENT_SCHEDULE&TAB REPORT'!O56","v":0},{"$f":"'8.2 - VENT_SCHEDULE&TAB REPORT'!Q56","v":0},null,null,null,"No","No"]
["8.6.5","Demand Controls",{"$f":"'8.2 - VENT_SCHEDULE&TAB REPORT'!F57","v":0},{"$f":"'8.2 - VENT_SCHEDULE&TAB REPORT'!G57","v":0},{"$f":"'8.2 - VENT_SCHEDULE&TAB REPORT'!H57","v":0},{"$f":"'8.2 - VENT_SCHEDULE&TAB REPORT'!O57","v":0},{"$f":"'8.2 - VENT_SCHEDULE&TAB REPORT'!P57","v":0},{"$f":"'8.2 - VENT_SCHEDULE&TAB REPORT'!R57","v":0},{"$f":"'8.2 - VENT_SCHEDULE&TAB REPORT'!O57","v":0},{"$f":"'8.2 - VENT_SCHEDULE&TAB REPORT'!Q57","v":0},null,null,null,"No","No"]
["8.6.6","Central Supply to Corridor",{"$f":"'8.2 - VENT_SCHEDULE&TAB REPORT'!#REF!","v":{"$error":"#REF!"}},{"$f":"'8.2 - VENT_SCHEDULE&TAB REPORT'!#REF!","v":{"$error":"#REF!"}},{"$f":"'8.2 - VENT_SCHEDULE&TAB REPORT'!#REF!","v":{"$error":"#REF!"}},{"$f":"'8.2 - VENT_SCHEDULE&TAB REPORT'!#REF!","v":{"$error":"#REF!"}},{"$f":"'8.2 - VENT_SCHEDULE&TAB REPORT'!#REF!","v":{"$error":"#REF!"}},{"$f":"'8.2 - VENT_SCHEDULE&TAB REPORT'!#REF!","v":{"$error":"#REF!"}},{"$f":"'8.2 - VENT_SCHEDULE&TAB REPORT'!#REF!","v":{"$error":"#REF!"}},{"$f":"'8.2 - VENT_SCHEDULE&TAB REPORT'!#REF!","v":{"$error":"#REF!"}},null,null,null,{"$f":"IF(OR(G172=\"No\",G172=0), \"No\", \"Yes\")","v":{"$error":"#REF!"}},{"$f":"IF(OR(J172=\"No\",J172=0), \"No\", \"Yes\")","v":{"$error":"#REF!"}}]
["8.6.7","Heat Recovery",{"$f":"'8.2 - VENT_SCHEDULE&TAB REPORT'!F59","v":0},{"$f":"'8.2 - VENT_SCHEDULE&TAB REPORT'!G59","v":0},{"$f":"'8.2 - VENT_SCHEDULE&TAB REPORT'!H58","v":0},{"$f":"'8.2 - VENT_SCHEDULE&TAB REPORT'!O58","v":0},{"$f":"'8.2 - VENT_SCHEDULE&TAB REPORT'!P58","v":0},{"$f":"'8.2 - VENT_SCHEDULE&TAB REPORT'!R58","v":0},{"$f":"'8.2 - VENT_SCHEDULE&TAB REPORT'!O58","v":0},{"$f":"'8.2 - VENT_SCHEDULE&TAB REPORT'!Q58","v":0},null,null,null,"No","No"]
["GARAGE VENTILATION"]
["8.7.1","Garage Exhaust Fan CFM and Efficiency",{"$f":"'8.2 - VENT_SCHEDULE&TAB REPORT'!F60","v":0},{"$f":"'8.2 - VENT_SCHEDULE&TAB REPORT'!G60","v":0},{"$f":"'8.2 - VENT_SCHEDULE&TAB REPORT'!H60","v":0},{"$f":"'8.2 - VENT_SCHEDULE&TAB REPORT'!O60","v":0},{"$f":"'8.2 - VENT_SCHEDULE&TAB REPORT'!P60","v":0},{"$f":"'8.2 - VENT_SCHEDULE&TAB REPORT'!R60","v":0},{"$f":"'8.2 - VENT_SCHEDULE&TAB REPORT'!O60","v":0},{"$f":"'8.2 - VENT_SCHEDULE&TAB REPORT'!Q60","v":0},null,null,null,"No","No"]
["8.7.2","Test Sensor Operation (Statement of Substantial Completion Accepted)","N/A","N/A",{"$f":"'8.2 - VENT_SCHEDULE&TAB REPORT'!H61","v":0},{"$f":"'8.2 - VENT_SCHEDULE&TAB REPORT'!O61","v":0},{"$f":"'8.2 - VENT_SCHEDULE&TAB REPORT'!P61","v":0},{"$f":"'8.2 - VENT_SCHEDULE&TAB REPORT'!R61","v":0},{"$f":"'8.2 - VENT_SCHEDULE&TAB REPORT'!O61","v":0},{"$f":"'8.2 - VENT_SCHEDULE&TAB REPORT'!Q61","v":0},null,null,null,"No","No"]
["VENTILATION MISC"]
["8.8.1","Toilet, Kitchen, General Exhaust Grilles and Corridor Supply Ventilation Grilles","N/A","N/A",{"$f":"'8.2 - VENT_SCHEDULE&TAB REPORT'!H65","v":0},{"$f":"'8.2 - VENT_SCHEDULE&TAB REPORT'!O65","v":0},{"$f":"'8.2 - VENT_SCHEDULE&TAB REPORT'!P65","v":0},{"$f":"'8.2 - VENT_SCHEDULE&TAB REPORT'!R65","v":0},{"$f":"'8.2 - VENT_SCHEDULE&TAB REPORT'!O65","v":0},{"$f":"'8.2 - VENT_SCHEDULE&TAB REPORT'!Q65","v":0},null,null,null,"No","No"]
["8.8.2","Intake  Systems - Operating Sequence","N/A","N/A",{"$f":"'8.2 - VENT_SCHEDULE&TAB REPORT'!H67","v":0},{"$f":"'8.2 - VENT_SCHEDULE&TAB REPORT'!O67","v":0},{"$f":"'8.2 - VENT_SCHEDULE&TAB REPORT'!P67","v":0},{"$f":"'8.2 - VENT_SCHEDULE&TAB REPORT'!R67","v":0},{"$f":"'8.2 - VENT_SCHEDULE&TAB REPORT'!O67","v":0},{"$f":"'8.2 - VENT_SCHEDULE&TAB REPORT'!Q67","v":0},null,null,null,{"$f":"IF(OR(G179=\"No\",G179=0), \"No\", \"Yes\")","v":"No"},{"$f":"IF(OR(J179=\"No\",J179=0), \"No\", \"Yes\")","v":"No"}]
["8.8.3","Make Up Air Systems","N/A","N/A",{"$f":"'8.2 - VENT_SCHEDULE&TAB REPORT'!H68","v":0},{"$f":"'8.2 - VENT_SCHEDULE&TAB REPORT'!O68","v":0},{"$f":"'8.2 - VENT_SCHEDULE&TAB REPORT'!P68","v":0},{"$f":"'8.2 - VENT_SCHEDULE&TAB REPORT'!R68","v":0},{"$f":"'8.2 - VENT_SCHEDULE&TAB REPORT'!O68","v":0},{"$f":"'8.2 - VENT_SCHEDULE&TAB REPORT'!Q68","v":0},null,null,null,"No","No"]
["8.8.4","Common Area Supply Ventilation Controls","N/A","N/A",{"$f":"'8.2 - VENT_SCHEDULE&TAB REPORT'!H66","v":0},{"$f":"'8.2 - VENT_SCHEDULE&TAB REPORT'!O66","v":0},{"$f":"'8.2 - VENT_SCHEDULE&TAB REPORT'!P66","v":0},{"$f":"'8.2 - VENT_SCHEDULE&TAB REPORT'!R66","v":0},{"$f":"'8.2 - VENT_SCHEDULE&TAB REPORT'!O66","v":0},{"$f":"'8.2 - VENT_SCHEDULE&TAB REPORT'!Q66","v":0},null,null,null,"No","No"]
["8.8.6","Passive Intake Systems (Trickle Vents)","N/A","N/A","N/A","N/A","N/A",{"$f":"'8.2 - VENT_SCHEDULE&TAB REPORT'!R70","v":0},"N/A",{"$f":"'8.2 - VENT_SCHEDULE&TAB REPORT'!Q70","v":0},null,null,null,"Yes","No"]
["8.8.7","Ventilation - Manufacturer's Product Data","N/A","N/A","N/A","N/A","N/A",{"$f":"'8.2 - VENT_SCHEDULE&TAB REPORT'!R71","v":0},"N/A",{"$f":"'8.2 - VENT_SCHEDULE&TAB REPORT'!Q71","v":0},null,null,null,"Yes","No"]
["8.8.8","Ventilation - Training and Manuals","N/A","N/A","N/A","N/A","N/A",{"$f":"'8.2 - VENT_SCHEDULE&TAB REPORT'!R72","v":0},"N/A",{"$f":"'8.2 - VENT_SCHEDULE&TAB REPORT'!Q72","v":0},null,null,null,"Yes","No"]
["8.8.9","Statement of Substantial Completion - HVAC","N/A","N/A","N/A","N/A","N/A",{"$f":"'8.2 - VENT_SCHEDULE&TAB REPORT'!#REF!","v":{"$error":"#REF!"}},"N/A",{"$f":"'8.2 - VENT_SCHEDULE&TAB REPORT'!#REF!","v":{"$error":"#REF!"}},null,null,null,{"$f":"IF(OR(G185=\"No\",G185=0), \"No\", \"Yes\")","v":"Yes"},{"$f":"IF(OR(J185=\"No\",J185=0), \"No\", \"Yes\")","v":{"$error":"#REF!"}}]
["DUCT TIGHTNESS"]
["8.9.1","Duct Tightness - Notes for Drawings and Specifications","N/A","N/A",{"$f":"'8.2 - VENT_DUCT TIGHTNESS'!$F$30","v":0},{"$f":"'8.2 - VENT_DUCT TIGHTNESS'!$G$30","v":0},{"$f":"'8.2 - VENT_DUCT TIGHTNESS'!$H$30","v":0},"N/A","N/A","N/A",null,null,null,{"$f":"IF(OR(G187=\"No\",G187=0), \"No\", \"Yes\")","v":"No"},{"$f":"IF(OR(J187=\"No\",J187=0), \"No\", \"Yes\")","v":"Yes"}]
["8.9.2","Duct Tightness - General",{"$f":"'8.2 - VENT_DUCT TIGHTNESS'!D32","v":0},{"$f":"'8.2 - VENT_DUCT TIGHTNESS'!E32","v":0},{"$f":"'8.2 - VENT_DUCT TIGHTNESS'!F32","v":0},{"$f":"'8.2 - VENT_DUCT TIGHTNESS'!G32","v":0},{"$f":"'8.2 - VENT_DUCT TIGHTNESS'!H32","v":0},{"$f":"'8.2 - VENT_DUCT TIGHTNESS'!J32","v":0},{"$f":"'8.2 - VENT_DUCT TIGHTNESS'!G32","v":0},{"$f":"'8.2 - VENT_DUCT TIGHTNESS'!I32","v":0},null,null,null,"No","No"]
["8.9.3","Duct Tightness - Roof Curb",{"$f":"'8.2 - VENT_DUCT TIGHTNESS'!D32","v":0},{"$f":"'8.2 - VENT_DUCT TIGHTNESS'!E32","v":0},{"$f":"'8.2 - VENT_DUCT TIGHTNESS'!F33","v":0},{"$f":"'8.2 - VENT_DUCT TIGHTNESS'!G33","v":0},{"$f":"'8.2 - VENT_DUCT TIGHTNESS'!H33","v":0},{"$f":"'8.2 - VENT_DUCT TIGHTNESS'!J33","v":0},{"$f":"'8.2 - VENT_DUCT TIGHTNESS'!G33","v":0},{"$f":"'8.2 - VENT_DUCT TIGHTNESS'!I33","v":0},null,null,null,{"$f":"IF(OR(G189=\"No\",G189=0), \"No\", \"Yes\")","v":"No"},{"$f":"IF(OR(J189=\"No\",J189=0), \"No\", \"Yes\")","v":"No"}]
["8.9.3","Duct Leakage Testing - Central Exhaust Systems","N/A","N/A","N/A","N/A","N/A",{"$f":"'8.2 - VENT_DUCT TIGHTNESS'!J34","v":0},"N/A",{"$f":"'8.2 - VENT_DUCT TIGHTNESS'!I34","v":0},null,null,null,"Yes","No"]
["8.9.11","Statement of Substantial Completion - HVAC","N/A","N/A","N/A","N/A","N/A",{"$f":"'8.2 - VENT_DUCT TIGHTNESS'!#REF!","v":{"$error":"#REF!"}},"N/A",{"$f":"'8.2 - VENT_DUCT TIGHTNESS'!#REF!","v":{"$error":"#REF!"}},null,null,null,{"$f":"IF(OR(G191=\"No\",G191=0), \"No\", \"Yes\")","v":"Yes"},{"$f":"IF(OR(J191=\"No\",J191=0), \"No\", \"Yes\")","v":{"$error":"#REF!"}}]
[9,"METERS"]
["9.1.1","Location - Residential","N/A","N/A",{"$f":"'9.1 - METERS'!I28","v":0},{"$f":"'9.1 - METERS'!J28","v":0},{"$f":"'9.1 - METERS'!K28","v":0},{"$f":"'9.1 - METERS'!M28","v":0},{"$f":"'9.1 - METERS'!J28","v":0},{"$f":"'9.1 - METERS'!L28","v":0},null,null,null,{"$f":"IF(OR(G193=\"No\",G193=0), \"No\", \"Yes\")","v":"No"},{"$f":"IF(OR(J193=\"No\",J193=0), \"No\", \"Yes\")","v":"No"}]
["9.1.2","Location - Non Residential","N/A","N/A",{"$f":"'9.1 - METERS'!I29","v":0},{"$f":"'9.1 - METERS'!J29","v":0},{"$f":"'9.1 - METERS'!K29","v":0},{"$f":"'9.1 - METERS'!M29","v":0},{"$f":"'9.1 - METERS'!J29","v":0},{"$f":"'9.1 - METERS'!L29","v":0},null,null,null,"No","No"]
["9.1.5","Utility Release Forms","N/A","N/A","N/A","N/A","N/A",{"$f":"'9.1 - METERS'!M32","v":0},"N/A",{"$f":"'9.1 - METERS'!L32","v":0},null,null,null,"Yes","No"]
["9.1.6","Statement of Substantial Completion","N/A","N/A","N/A","N/A","N/A",{"$f":"'9.1 - METERS'!M33","v":0},"N/A",{"$f":"'9.1 - METERS'!L33","v":0},null,null,null,"Yes","No"]

{"sheet":"Sheet2","index":29,"n_rows":0,"n_cols":0,"rows_kept":0,"cut":false,"hidden":false,"merged":[]}